{"text_format":"1","workbook":"xlsx","n_sheets":7,"sheets":["Seizoen 2009-2010","Seizoen 2010-2011","Seizoen 2011-2012","Seizoen 2012-2013 ","Seizoen 2013-2014  ","Seizoen 2014-2015","Totaal"],"not_rendered":{"charts":0,"images":0,"macros":1,"external_links":0,"defined_names":4,"comments":0,"pivot_tables":0},"unopened":[],"bounds":{"document_bytes":16777216,"sheet_cells":100000,"rows_first":2000,"rows_last":500,"rows_between":2000,"halvings":0,"cell_chars":16384,"cell_head_chars":4096},"cells_cut":0,"cells_raw":0,"read":"whole","date_system":"1900"}

{"sheet":"Seizoen 2009-2010","index":0,"n_rows":63,"n_cols":30,"rows_kept":63,"cut":false,"hidden":false,"merged":[[1,20,1,24],[1,25,1,29]]}
[null,"Competitie",null,null,null,null,null,null,null,null,null,null,"Wedstrijden"]
[null,null,null,null,null,null,null,null,null,null,null,null,null,null,null,null,null,null,null,null,"Thuis",null,null,null,null,"Uit"]
[null,"Speler","Aanwezig","Matchen","Afvaller","Forfait","Doelpunten","Gem doelp.","% aandeel","Geel","Rood",null,"Datum","Wedstrijd","Winst","Gelijk","Verlies","Voor ","Tegen","DS","Winst","Gelijk","Verlies","Voor ","Tegen","Winst","Gelijk","Verlies","Voor ","Tegen"]
[null,"De Decker Guy",{"$f":"SUM(D4:F4)","v":16},16,0,0,0,{"$f":"G4/D4","v":0},{"$f":"$G4/$G$15","v":0},0,0,null,"2009-09-17","De Cupmaten - Spinpedes B ",{"$f":"U4+Z4","v":0},{"$f":"V4+AA4","v":0},{"$f":"W4+AB4","v":1},{"$f":"X4+AC4","v":0},{"$f":"Y4+AD4","v":10},{"$f":"R4-S4","v":-10},0,0,1,0,10,0,0,0,0,0]
[null,"Lenaerts Jaan",{"$f":"SUM(D5:F5)","v":15},15,0,0,0,{"$f":"G5/D5","v":0},{"$f":"$G5/$G$15","v":0},0,0,null,"2009-09-23","De Waterput - De Cupmaten ",{"$f":"U5+Z5","v":0},{"$f":"V5+AA5","v":0},{"$f":"W5+AB5","v":1},{"$f":"X5+AC5","v":3},{"$f":"Y5+AD5","v":12},{"$f":"R5-S5","v":-9},0,0,0,0,0,0,0,1,3,12]
[null,"De Decker Koen",13,13,0,0,4,0.30769230769230771,5.5555555555555552E-2,0,0,null,"2009-10-01","De Cupmaten - Boomerangs B ",1,0,0,6,2,4,1,0,0,6,2,0,0,0,0,0]
[null,"Van Gils Bart",15,15,0,0,15,1,0.20833333333333334,1,1,null,"2009-10-05","Het Kafeeke - De Cupmaten (BK)  ",0,0,1,3,6,-3,0,0,0,0,0,0,0,1,3,6]
[null,"Vajda Dierckx Davy",12,12,0,0,5,0.41666666666666669,6.9444444444444448E-2,0,0,null,"2009-10-15","De Cupmaten - Boost (BK)",0,0,1,2,7,-5,0,0,1,2,7,0,0,0,0,0]
[null,"De Decker Hans",19,19,0,0,12,0.63157894736842102,0.16666666666666666,0,0,null,"2009-10-19","Wollewei - De Cupmaten ",0,0,1,3,9,-6,0,0,0,0,0,0,0,1,3,9]
[null,"Broeders Martijn",4,4,0,0,1,0.25,1.3888888888888888E-2,0,0,null,"2009-10-29","De Cupmaten - De Plekkers (JK)",0,0,1,1,12,-11,0,0,1,1,12,0,0,0,0,0]
[null,"Van Dijck Vincent",15,14,1,0,2,0.14285714285714285,2.7777777777777776E-2,0,0,null,"2009-11-12","De Cupmaten – KDS. Turnhout ",0,0,1,2,3,-1,0,0,1,2,3,0,0,0,0,0]
[null,"Westhof Jan",19,18,1,0,11,0.61111111111111116,0.15277777777777779,0,0,null,"2009-11-16","Ministerie - De Cupmaten ",0,0,1,3,10,-7,0,0,0,0,0,0,0,1,3,10]
[null,"Dom Steven",20,19,1,0,22,1.1578947368421053,0.30555555555555558,3,0,null,"2009-11-30","Tugas - De Cupmaten ",0,0,1,3,7,-4,0,0,0,0,0,0,0,1,3,7]
[null,null,null,null,null,null,null,null,null,null,null,null,"2009-12-07","Turnhout 86 - De Cupmaten ",0,0,1,4,6,-2,0,0,0,0,0,0,0,1,4,6]
[null,null,null,20,null,null,{"$f":"SUM(G4:G13)","v":72},{"$f":"G15/D15","v":3.6},null,{"$f":"SUM(J4:J14)","v":4},{"$f":"SUM(K4:K14)","v":1},null,"2009-12-10","De Cupmaten – Desportivo ",0,0,1,1,5,-4,0,0,1,1,5,0,0,0,0,0]
[null,null,null,null,null,null,null,null,null,null,null,null,"2009-12-17","De Cupmaten – P&V Turnhout ",0,0,1,3,5,-2,0,0,1,3,5,0,0,0,0,0]
[null,"Beker",null,null,null,null,null,null,null,null,null,null,"2010-01-14","De Cupmaten - Tugas ",0,0,1,3,5,-2,0,0,1,3,5,0,0,0,0,0]
[null,null,null,null,null,null,null,null,null,null,null,null,"2010-01-21","Spinpedes B - De Cupmaten ",1,0,0,5,3,2,0,0,0,0,0,1,0,0,5,3]
[null,"Speler","Aanwezig","Matchen","Afvaller","Forfait","Doelpunten","Gem doelp.","% aandeel","Geel","Rood",null,"2010-02-04","De Cupmaten – De Waterput ",0,0,1,4,8,-4,0,0,1,4,8,0,0,0,0,0]
[null,"De Decker Guy",{"$f":"SUM(D20:F20)","v":3},3,0,0,0,{"$f":"G20/D20","v":0},{"$f":"$G20/$G$31","v":0},0,0,null,"2010-02-18","De Cupmaten - Wollewei ",0,1,0,3,3,0,0,1,0,3,3,0,0,0,0,0]
[null,"Lenaerts Jaan",{"$f":"SUM(D21:F21)","v":3},3,0,0,0,{"$f":"G21/D21","v":0},{"$f":"$G21/$G$31","v":0},0,0,null,"2010-03-03","Desportivo - De Cupmaten ",0,0,1,1,8,-7,0,0,0,0,0,0,0,1,1,8]
[null,"De Decker Koen",2,2,0,0,0,0,0,0,0,null,"2010-03-10","P&V Turnhout- De Cupmaten ",0,1,0,6,6,0,0,0,0,0,0,0,1,0,6,6]
[null,"Van Gils Bart",3,3,0,0,1,0.33333333333333331,0.16666666666666666,0,0,null,"2010-03-18","De Cupmaten – Ministerie ",0,0,1,1,5,-4,0,0,1,1,5,0,0,0,0,0]
[null,"Vajda Dierckx Davy",2,2,0,0,0,0,0,0,0,null,"2010-03-24","KDS. Turnhout- De Cupmaten ",1,0,0,7,3,4,0,0,0,0,0,1,0,0,7,3]
[null,"De Decker Hans",3,3,0,0,3,1,0.5,0,0,null,"2010-04-01","De Cupmaten – Turnhout 86 ",0,0,1,4,8,-4,0,0,1,4,8,0,0,0,0,0]
[null,"Broeders Martijn",0,0,0,0,0,0,0,0,0,null,"2010-03-24","Boomerangs B - De Cupmaten ",1,0,0,10,9,1,0,0,0,0,0,1,0,0,10,9]
[null,"Van Dijck Vincent",3,3,0,0,1,0.33333333333333331,0.16666666666666666,0,0,null,"Totaal",null,{"$f":"SUM(O4:O26)","v":4},{"$f":"SUM(P4:P26)","v":2},17,78,152,{"$f":"SUM(T4:T26)","v":-74},1,1,10,30,73,3,1,7,48,79]
[null,"Westhof Jan",3,3,0,0,1,0.33333333333333331,0.16666666666666666,0,0]
[null,"Dom Steven",1,1,0,0,0,0,0,0,0,null,null,"Gemiddelde",{"$f":"$O27/$D$63","v":0.17391304347826086},{"$f":"P27/D63","v":8.6956521739130432E-2},{"$f":"Q27/D63","v":0.73913043478260865},{"$f":"R27/D63","v":3.3913043478260869},{"$f":"S27/D63","v":6.6086956521739131},{"$f":"T27/D63","v":-3.2173913043478262},{"$f":"U27/12","v":8.3333333333333329E-2},{"$f":"V27/12","v":8.3333333333333329E-2},{"$f":"W27/12","v":0.83333333333333337},{"$f":"X27/12","v":2.5},{"$f":"Y27/12","v":6.083333333333333},{"$f":"Z27/11","v":0.27272727272727271},{"$f":"AA27/11","v":9.0909090909090912E-2},{"$f":"AB27/11","v":0.63636363636363635},{"$f":"AC27/11","v":4.3636363636363633},{"$f":"AD27/11","v":7.1818181818181817}]
[]
[null,null,null,3,null,null,{"$f":"SUM(G20:G29)","v":6},{"$f":"G31/D31","v":2},null,{"$f":"SUM(J20:J30)","v":0},{"$f":"SUM(K20:K30)","v":0}]
[null,null,null,null,null,null,null,null,null,null,null,null,"Eindklassement"]
[null,"Totaal"]
[]
[null,"Speler","Aanwezig","Matchen","Afvaller","Forfait","Doelpunten","Gem doelp.","% aandeel","Geel","Rood"]
[{"$f":"$G36-$G36/100-(G36/D36)+(D36/100)","v":0.19},"De Decker Guy",{"$f":"C4+C20","v":19},{"$f":"D4+D20","v":19},{"$f":"E4+E20","v":0},{"$f":"F4+F20","v":0},{"$f":"G20+G4","v":0},{"$f":"G36/D36","v":0},{"$f":"$G36/$G$47","v":0},{"$f":"J4+J20","v":0},0]
[{"$f":"$G37-$G37/100-(G37/D37)+(D37/100)-0.1","v":7.9999999999999988E-2},"Lenaerts Jaan",{"$f":"C5+C21","v":18},18,0,0,0,{"$f":"G37/D37","v":0},{"$f":"$G37/$G$47","v":0},0,0]
[{"$f":"$G38-$G38/100-(G38/D38)+(D38/100)","v":3.8433333333333333},"De Decker Koen",15,15,0,0,4,0.26666666666666666,5.128205128205128E-2,0,0]
[{"$f":"$G39-$G39/100-(G39/D39)+(D39/100)","v":15.13111111111111},"Van Gils Bart",18,18,0,0,16,0.88888888888888884,0.20512820512820512,1,1]
[4.7328571428571431,"Vajda Dierckx Davy",14,14,0,0,5,0.35714285714285715,6.4102564102564097E-2,0,0]
[14.388181818181819,"De Decker Hans",22,22,0,0,15,0.68181818181818177,0.19230769230769232,0,0]
[0.78,"Broeders Martijn",4,4,0,0,1,0.25,1.282051282051282E-2,0,0]
[2.9635294117647062,"Van Dijck Vincent",18,17,1,0,3,0.17647058823529413,3.8461538461538464E-2,0,0]
[11.51857142857143,"Westhof Jan",22,21,1,0,12,0.5714285714285714,0.15384615384615385,0,0]
[20.88,"Dom Steven",21,20,1,0,22,1.1000000000000001,0.28205128205128205,3,0]
[]
[null,null,null,{"$f":"D15+D31","v":23},null,null,{"$f":"SUM(G36:G45)","v":78},{"$f":"G47/D47","v":3.3913043478260869},null,{"$f":"SUM(J36:J46)","v":4},{"$f":"SUM(K36:K46)","v":1}]
[]
[null,"Totaal"]
[null,null,null,null,null,null,null,null,null,null,null,null,null,"Ploeg","Winst","Gelijk","Verlies","Voor ","Tegen","DS","Punten"]
[null,"Speler","Aanwezig","Matchen","Afvaller","Forfait","Doelpunten","Gem doelp.","% aandeel","Geel","Rood",null,1,"Tugas",16,2,2,164,52,{"$f":"R51-S51","v":112},50]
[{"$f":"LARGE($A$36:$A$45,ROW(A1))","v":20.88},{"$f":"VLOOKUP($A52,$A$36:$H$45,COLUMN(B1),FALSE)","v":"Dom Steven"},{"$f":"VLOOKUP($A52,$A$36:$H$45,COLUMN(C1),FALSE)","v":21},20,1,0,22,1.1000000000000001,{"$f":"VLOOKUP($A52,$A$36:$K$45,COLUMN(I1),FALSE)","v":0.28205128205128205},3,0,null,2,"Desportivo",15,2,3,131,53,{"$f":"R52-S52","v":78},47]
[{"$f":"LARGE($A$36:$A$45,ROW(A2))","v":15.13111111111111},"Van Gils Bart",{"$f":"VLOOKUP($A53,$A$36:$H$45,COLUMN(C2),FALSE)","v":18},18,0,0,16,0.88888888888888884,0.20512820512820512,1,1,null,3,"P&V Turnhout",14,2,4,138,65,73,44]
[14.388181818181819,"De Decker Hans",22,22,0,0,15,0.68181818181818177,0.19230769230769232,0,0,null,4,"De Waterput",14,1,5,120,82,38,43]
[11.51857142857143,"Westhof Jan",22,21,1,0,12,0.5714285714285714,0.15384615384615385,0,0,null,5,"Spinpedes B",11,1,8,126,80,46,34]
[4.7328571428571431,"Vajda Dierckx Davy",14,14,0,0,5,0.35714285714285715,6.4102564102564097E-2,0,0,null,6,"Ministerie",11,0,9,169,105,64,33]
[3.8433333333333333,"De Decker Koen",15,15,0,0,4,0.26666666666666666,5.128205128205128E-2,0,0,null,7,"Wollewei",7,2,11,96,118,-22,23]
[2.9635294117647062,"Van Dijck Vincent",18,17,1,0,3,0.17647058823529413,3.8461538461538464E-2,0,0,null,8,"Turnhout 86",7,1,12,89,112,-23,22]
[0.78,"Broeders Martijn",4,4,0,0,1,0.25,1.282051282051282E-2,0,0,null,9,"De Cupmaten",4,2,14,73,127,-54,14]
[0.19,"De Decker Guy",19,19,0,0,0,0,{"$f":"VLOOKUP($A60,$A$36:$K$45,COLUMN(I9),FALSE)","v":0},0,0,null,10,"KDS. Turnhout",4,0,16,54,154,-100,12]
[7.9999999999999988E-2,{"$f":"VLOOKUP($A61,$A$36:$H$45,COLUMN(B10),FALSE)","v":"Lenaerts Jaan"},18,18,0,0,0,0,0,0,0,null,11,"Boomerangs B",0,1,19,50,262,-212,1]
[]
[null,null,23,{"$f":"D47","v":23},null,null,{"$f":"G47","v":78},{"$f":"H47","v":3.3913043478260869},null,{"$f":"J47","v":4},{"$f":"K47","v":1}]

{"sheet":"Seizoen 2010-2011","index":1,"n_rows":65,"n_cols":30,"rows_kept":65,"cut":false,"hidden":false,"merged":[[1,20,1,24],[1,25,1,29]]}
[null,"Competitie",null,null,null,null,null,null,null,null,null,null,"Wedstrijden"]
[null,null,null,null,null,null,null,null,null,null,null,null,null,null,null,null,null,null,null,null,"Thuis",null,null,null,null,"Uit"]
[null,"Speler","Aanwezig","Matchen","Afvaller","Forfait","Doelpunten","Gem doelp.","% aandeel","Geel","Rood",null,"Datum","Wedstrijd","Winst","Gelijk","Verlies","Voor ","Tegen","DS","Winst","Gelijk","Verlies","Voor ","Tegen","Winst","Gelijk","Verlies","Voor ","Tegen"]
[null,"De Decker Guy",{"$f":"D4+E4+F4","v":13},11,1,1,0,{"$f":"G4/D4","v":0},{"$f":"$G4/$G$15","v":0},0,0,null,"2010-09-09","De Cupmaten - Boomerangs B (Forfait)",{"$f":"U4+Z4","v":1},{"$f":"V4+AA4","v":0},{"$f":"W4+AB4","v":0},{"$f":"X4+AC4","v":5},{"$f":"Y4+AD4","v":0},{"$f":"R4-S4","v":5},1,0,0,5,0,0,0,0,0,0]
[null,"Lenaerts Jaan",{"$f":"D5+E5+F5","v":11},10,0,1,2,{"$f":"G5/D5","v":0.2},{"$f":"$G5/$G$15","v":2.7397260273972601E-2},2,1,null,"2010-09-13","Ministerie - De Cupmaten ",{"$f":"U5+Z5","v":0},{"$f":"V5+AA5","v":0},{"$f":"W5+AB5","v":1},{"$f":"X5+AC5","v":1},{"$f":"Y5+AD5","v":8},{"$f":"R5-S5","v":-7},0,0,0,0,0,0,0,1,1,8]
[null,"De Decker Koen",14,13,0,1,2,0.15384615384615385,2.7397260273972601E-2,0,0,null,"2010-09-21","Barza – De Cupmaten ",0,0,1,6,8,-2,0,0,0,0,0,0,0,1,6,8]
[null,"Van Gils Bart",12,12,0,0,10,0.83333333333333337,0.13698630136986301,3,1,null,"2010-10-07","De Cupmaten – Verschilboys B ",1,0,0,6,4,2,1,0,0,6,4,0,0,0,0,0]
[null,"Vajda Dierckx Davy",11,10,0,1,8,0.8,0.1095890410958904,0,0,null,"2010-10-21","De Cupmaten – De Waterput ",0,0,1,5,9,-4,0,0,1,5,9,0,0,0,0,0]
[null,"De Decker Hans",18,17,0,1,2,0.11764705882352941,2.7397260273972601E-2,0,0,null,"2010-10-25","Turnhout 86 - De Cupmaten ",0,0,1,4,5,-1,0,0,0,0,0,0,0,1,4,5]
[null,"Stymans Gert",6,5,0,1,2,0.4,2.7397260273972601E-2,1,0,null,"2010-11-04","De Cupmaten - De Zwaluw (BK)",0,0,1,7,15,-8,0,0,1,7,15,0,0,0,0,0]
[null,"Van Dijck Vincent",17,16,1,0,5,0.3125,6.8493150684931503E-2,1,0,null,"2010-11-04","Supraboys - De Cupmaten ",0,1,0,4,4,0,0,0,0,0,0,0,1,0,4,4]
[null,"Westhof Jan",17,16,0,1,10,0.625,0.13698630136986301,1,0,null,"2010-11-18","De Cupmaten – KDS. Turnhout ",1,0,0,12,1,11,1,0,0,12,1,0,0,0,0,0]
[null,"Dom Steven",18,17,0,1,32,1.8823529411764706,0.43835616438356162,0,0,null,"2010-11-22","Atlético - De Cupmaten (BK)",0,0,1,1,11,-10,0,0,0,0,0,0,0,1,1,11]
[null,null,null,null,null,null,null,null,null,null,null,null,"2010-12-16","De Cupmaten - Jumpaz United",0,0,1,3,9,-6,0,0,1,3,9,0,0,0,0,0]
[null,null,18,17,null,1,{"$f":"SUM(G4:G13)","v":73},{"$f":"G15/D15","v":4.2941176470588234},null,{"$f":"SUM(J4:J14)","v":8},{"$f":"SUM(K4:K14)","v":2},null,"2011-01-06","De Cupmaten - Fettah (BK) (Forfait)",1,0,0,5,0,5,1,0,0,5,0,0,0,0,0,0]
[null,null,null,null,null,null,null,null,null,null,null,null,"2011-01-13","De Cupmaten – Ministerie ",0,0,1,4,10,-6,0,0,1,4,10,0,0,0,0,0]
[null,"Beker",null,null,null,null,null,null,null,null,null,null,"2011-01-26","Boomerangs B - De Cupmaten",0,0,1,4,5,-1,0,0,0,0,0,0,0,1,4,5]
[null,null,null,null,null,null,null,null,null,null,null,null,"2011-02-10","De Cupmaten - Barza",1,0,0,{"$f":"X18+AC18","v":3},1,2,1,0,0,3,1,0,0,0,0,0]
[null,"Speler","Aanwezig","Matchen","Afvaller","Forfait","Doelpunten","Gem doelp.","% aandeel","Geel","Rood",null,"2011-03-04","Verschilboys B - De Cupmaten",0,0,1,1,8,-7,0,0,0,0,0,0,0,1,1,8]
[null,"De Decker Guy",{"$f":"D20+E20+F20","v":1},1,0,0,0,{"$f":"G20/D20","v":0},{"$f":"$G20/$G$31","v":0},0,0,null,"2011-03-10","De Cupmaten - Supraboys",0,0,1,5,6,-1,0,0,1,5,6,0,0,0,0,0]
[null,"Lenaerts Jaan",{"$f":"D21+E21+F21","v":1},1,0,0,0,{"$f":"G21/D21","v":0},{"$f":"$G21/$G$31","v":0},0,0,null,"2011-03-14","Jumpaz United - De Cupmaten",0,0,1,1,6,-5,0,0,0,0,0,0,0,1,1,6]
[null,"De Decker Koen",3,2,0,1,1,0.5,0.125,0,0,null,"2011-03-24","De Cupmaten - Turnhout 86",0,0,1,4,6,-2,0,0,1,4,6,0,0,0,0,0]
[null,"Van Gils Bart",1,0,0,1,0,0,0,0,0,null,"2011-03-28","KDS. Turnhout- De Cupmaten ",1,0,0,8,1,7,0,0,0,0,0,1,0,0,8,1]
[null,"Vajda Dierckx Davy",1,1,0,0,1,1,0.125,0,0,null,"2011-04-11","De Waterput - De Cupmaten",0,0,1,3,11,-8,0,0,0,0,0,0,0,1,3,11]
[null,"De Decker Hans",3,2,0,1,0,0,0,0,0,null,"Totaal",null,{"$f":"SUM(O4:O24)","v":6},{"$f":"SUM(P4:P24)","v":1},14,{"$f":"SUM(R4:R24)","v":92},128,{"$f":"SUM(T4:T24)","v":-36},5,{"$f":"SUM(V4:V24)","v":0},6,59,61,1,1,8,33,67]
[null,"Stymans Gert",1,1,0,0,1,1,0.125,0,0]
[null,"Van Dijck Vincent",2,1,0,1,0,0,0,0,0,null,null,"Gemiddelde",{"$f":"O$25/($O$25+$P$25+$Q$25)","v":0.2857142857142857},4.7619047619047616E-2,0.66666666666666663,4.3809523809523814,6.0952380952380949,-1.7142857142857142,{"$f":"U$25/($U$25+$V$25+$W$25)","v":0.45454545454545453},{"$f":"V$25/($U$25+$V$25+$W$25)","v":0},{"$f":"W$25/($U$25+$V$25+$W$25)","v":0.54545454545454541},{"$f":"X$25/($U$25+$V$25+$W$25)","v":5.3636363636363633},{"$f":"Y$25/($U$25+$V$25+$W$25)","v":5.5454545454545459},{"$f":"Z$25/($Z$25+$AA$25+$AB$25)","v":0.1},{"$f":"AA$25/($Z$25+$AA$25+$AB$25)","v":0.1},{"$f":"AB$25/($Z$25+$AA$25+$AB$25)","v":0.8},{"$f":"AC$25/($Z$25+$AA$25+$AB$25)","v":3.3},{"$f":"AD$25/($Z$25+$AA$25+$AB$25)","v":6.7}]
[null,"Westhof Jan",3,2,0,1,0,0,0,0,0]
[null,"Dom Steven",3,2,0,1,5,2.5,0.625,0,0]
[]
[null,null,3,2,null,1,{"$f":"SUM(G20:G29)","v":8},{"$f":"G31/D31","v":4},null,{"$f":"SUM(J20:J30)","v":0},{"$f":"SUM(K20:K30)","v":0},null,null,null,null,null,null,"Forfait"]
[]
[null,"Totaal"]
[]
[null,"Speler","Aanwezig","Matchen","Afvaller","Forfait","Doelpunten","Gem doelp.","% aandeel","Geel","Rood"]
[{"$f":"$G36-$G36/100-(G36/D36)+(D36/100)","v":0.12},"De Decker Guy",{"$f":"C20+C4","v":14},{"$f":"D20+D4","v":12},{"$f":"E20+E4","v":1},{"$f":"F20+F4","v":1},{"$f":"G20+G4","v":0},{"$f":"G36/D36","v":0},{"$f":"$G36/$G$47","v":0},{"$f":"J4+J20","v":0},{"$f":"K4+K20","v":0}]
[{"$f":"$G37-$G37/100-(G37/D37)+(D37/100)","v":1.9081818181818182},"Lenaerts Jaan",{"$f":"C21+C5","v":12},11,0,1,2,{"$f":"G37/D37","v":0.18181818181818182},{"$f":"$G37/$G$47","v":2.4691358024691357E-2},{"$f":"J5+J21","v":2},1]
[2.92,"De Decker Koen",17,15,0,2,3,0.2,3.7037037037037035E-2,0,0]
[9.1866666666666656,"Van Gils Bart",13,12,0,1,10,0.83333333333333337,0.12345679012345678,3,1]
[8.2018181818181812,"Vajda Dierckx Davy",12,11,0,1,9,0.81818181818181823,0.1111111111111111,0,0]
[2.0647368421052632,"De Decker Hans",21,19,0,2,2,0.10526315789473684,2.4691358024691357E-2,0,0]
[2.5300000000000002,"Stymans Gert",7,6,0,1,3,0.5,3.7037037037037035E-2,1,0]
[4.8258823529411767,"Van Dijck Vincent",19,17,1,1,5,0.29411764705882354,6.1728395061728392E-2,1,0]
[9.5244444444444447,"Westhof Jan",20,18,0,2,10,0.55555555555555558,0.12345679012345678,1,0]
[34.87263157894737,"Dom Steven",21,19,0,2,37,1.9473684210526316,0.4567901234567901,0,0]
[]
[null,null,null,{"$f":"D15+D31","v":19},null,null,{"$f":"SUM(G36:G45)","v":81},{"$f":"G47/D47","v":4.2631578947368425},null,{"$f":"SUM(J36:J46)","v":8},{"$f":"SUM(K36:K46)","v":2}]
[]
[]
[]
[null,"Totaal"]
[]
[null,"Speler","Aanwezig","Matchen","Afvaller","Forfait","Doelpunten","Gem doelp.","% aandeel","Geel","Rood",null,"Eindklassement"]
[{"$f":"LARGE($A$36:$A$45,ROW(A1))","v":34.87263157894737},{"$f":"VLOOKUP($A54,$A$36:$K$45,COLUMN(B1),FALSE)","v":"Dom Steven"},{"$f":"VLOOKUP($A54,$A$36:$K$45,COLUMN(C1),FALSE)","v":21},19,0,2,37,1.9473684210526316,0.4567901234567901,0,0]
[{"$f":"LARGE($A$36:$A$45,ROW(A2))","v":9.5244444444444447},"Westhof Jan",{"$f":"VLOOKUP($A55,$A$36:$K$45,COLUMN(C2),FALSE)","v":20},18,0,2,10,0.55555555555555558,0.12345679012345678,1,0,null,null,"Ploeg","Winst","Gelijk","Verlies","Voor ","Tegen","DS","Punten"]
[9.1866666666666656,"Van Gils Bart",{"$f":"VLOOKUP($A56,$A$36:$K$45,COLUMN(C3),FALSE)","v":13},12,0,1,10,0.83333333333333337,0.12345679012345678,3,1,null,1,"Ministerie",18,0,0,199,49,150,54]
[8.2018181818181812,"Vajda Dierckx Davy",{"$f":"VLOOKUP($A57,$A$36:$K$45,COLUMN(C4),FALSE)","v":12},11,0,1,9,0.81818181818181823,0.1111111111111111,0,0,null,2,"Jumpaz United",15,1,2,161,53,108,46]
[4.8258823529411767,"Van Dijck Vincent",{"$f":"VLOOKUP($A58,$A$36:$K$45,COLUMN(C5),FALSE)","v":19},17,1,1,5,0.29411764705882354,6.1728395061728392E-2,1,0,null,3,"Turnhout 86",13,1,4,109,69,40,40]
[2.92,"De Decker Koen",{"$f":"VLOOKUP($A59,$A$36:$K$45,COLUMN(C6),FALSE)","v":17},15,0,2,3,0.2,3.7037037037037035E-2,0,0,null,4,"De Waterput",11,3,4,119,84,35,36]
[2.5300000000000002,"Stymans Gert",{"$f":"VLOOKUP($A60,$A$36:$K$45,COLUMN(C7),FALSE)","v":7},6,0,1,3,0.5,3.7037037037037035E-2,1,0,null,5,"Verschilboys B",8,1,9,86,104,-18,25]
[2.0647368421052632,"De Decker Hans",{"$f":"VLOOKUP($A61,$A$36:$K$45,COLUMN(C8),FALSE)","v":21},19,0,2,2,0.10526315789473684,2.4691358024691357E-2,0,0,null,6,"Supraboys",7,2,9,114,86,28,23]
[1.9081818181818182,{"$f":"VLOOKUP($A62,$A$36:$K$45,COLUMN(B9),FALSE)","v":"Lenaerts Jaan"},12,11,0,1,2,0.18181818181818182,2.4691358024691357E-2,2,1,null,7,"De Cupmaten",5,1,12,79,102,-23,16]
[0.12,{"$f":"VLOOKUP($A63,$A$36:$K$45,COLUMN(B10),FALSE)","v":"De Decker Guy"},14,12,1,1,0,0,0,0,0,null,8,"Barza",4,1,13,69,122,-53,13]
[null,null,null,null,null,null,null,null,null,null,null,null,9,"KDS. Turnhout",2,0,16,53,160,-107,6]
[null,null,21,{"$f":"D47","v":19},null,2,{"$f":"G47","v":81},{"$f":"H47","v":4.2631578947368425},null,{"$f":"J47","v":8},{"$f":"K47","v":2},null,10,"Boomerangs B",2,0,16,53,213,-160,6]

{"sheet":"Seizoen 2011-2012","index":2,"n_rows":69,"n_cols":30,"rows_kept":69,"cut":false,"hidden":false,"merged":[[1,20,1,24],[1,25,1,29],[2,20,2,24],[2,25,2,29]]}
[null,"Competitie",null,null,null,null,null,null,null,null,null,null,"Wedstrijden"]
[]
[null,"Speler","Aanwezig","Matchen","Afvaller","Forfait","Doelpunten","Gem doelp.","% aandeel","Geel","Rood",null,null,null,null,null,null,null,null,null,"Thuis",null,null,null,null,"Uit"]
[null,"De Decker Guy",15,14,1,null,null,{"$f":"IF(ISERROR(G4/D4),\"\",G4/D4)","v":0},{"$f":"IF(ISERROR($G4/$G$16),\"\",$G4/$G$16)","v":0},0,0,null,"Datum","Wedstrijd","Winst","Gelijk","Verlies","Voor ","Tegen","DS","Winst","Gelijk","Verlies","Voor ","Tegen","Winst","Gelijk","Verlies","Voor ","Tegen"]
[null,"Lenaerts Jaan",6,6,null,null,null,0,{"$f":"IF(ISERROR($G5/$G$16),\"\",$G5/$G$16)","v":0},0,0,null,"2011-09-05","Arendonk - De Cupmaten",{"$f":"U5+Z5","v":0},0,1,2,6,{"$f":"R5-S5","v":-4},0,0,0,0,0,0,0,1,2,6]
[null,"De Decker Koen",16,15,1,null,2,{"$f":"IF(ISERROR(G6/D6),\"\",G6/D6)","v":0.13333333333333333},1.8518518518518517E-2,1,0,null,"2011-09-15","De Cupmaten - Supraboys",0,0,1,3,8,{"$f":"R6-S6","v":-5},0,0,1,3,8,0,0,0,0,0]
[null,"Van Gils Bart",19,19,null,null,16,{"$f":"IF(ISERROR(G7/D7),\"\",G7/D7)","v":0.84210526315789469},0.14814814814814814,2,0,null,"2011-09-21","De Ster – De Cupmaten ",0,0,1,5,10,-5,0,0,0,0,0,0,0,1,5,10]
[null,"Vajda Dierckx Davy",12,11,1,null,12,{"$f":"IF(ISERROR(G8/D8),\"\",G8/D8)","v":1.0909090909090908},0.1111111111111111,0,0,null,"2011-09-29","De Cupmaten – Hoek van Portugal",0,0,1,1,4,-3,0,0,1,1,4,0,0,0,0,0]
[null,"De Decker Hans",21,21,null,null,8,0.38095238095238093,7.407407407407407E-2,2,1,null,"2011-10-13","De Cupmaten – KDS. Turnhout ",1,0,0,4,3,1,1,0,0,4,3,0,0,0,0,0]
[null,"Daemen Jan",8,8,null,null,1,0.125,9.2592592592592587E-3,0,0,null,"2011-10-19","De Sjepap - De Cupmaten ",0,0,1,4,12,-8,0,0,0,0,0,0,0,1,4,12]
[null,"Van Dijck Vincent",20,19,1,null,8,0.42105263157894735,7.407407407407407E-2,0,0,null,"2011-10-27","De Cupmaten - Boomerangs B",1,0,0,14,6,8,1,0,0,14,6,0,0,0,0,0]
[null,"Westhof Jan",22,21,1,null,11,0.52380952380952384,0.10185185185185185,0,0,null,"2011-11-14","Boost - De Cupmaten ",0,0,1,6,10,-4,0,0,0,0,0,0,0,1,6,10]
[null,"Dom Steven",23,23,null,null,38,1.6521739130434783,0.35185185185185186,1,0,null,"2011-11-23","De Bergen A - De Cupmaten (BK)",{"$f":"U13+Z13","v":0},{"$f":"V13+AA13","v":0},{"$f":"W13+AB13","v":1},{"$f":"X13+AC13","v":4},{"$f":"Y13+AD13","v":6},{"$f":"R13-S13","v":-2},0,0,0,0,0,0,0,1,4,6]
[null,"Daemen Geert-Jan",18,17,1,null,12,0.70588235294117652,{"$f":"IF(ISERROR($G14/$G$16),\"\",$G14/$G$16)","v":0.1111111111111111},0,0,null,"2011-12-01","De Cupmaten – Vijfde Wiel (Forfait)",{"$f":"U14+Z14","v":1},{"$f":"V14+AA14","v":0},{"$f":"W14+AB14","v":0},{"$f":"X14+AC14","v":5},{"$f":"Y14+AD14","v":0},{"$f":"R14-S14","v":5},1,0,0,5,0,0,0,0,0,0]
[null,null,null,null,null,null,null,null,null,null,null,null,"2011-12-05","Biljart Palace - De Cupmaten",{"$f":"U15+Z15","v":1},{"$f":"V15+AA15","v":0},{"$f":"W15+AB15","v":0},{"$f":"X15+AC15","v":6},{"$f":"Y15+AD15","v":2},{"$f":"R15-S15","v":4},0,0,0,0,0,1,0,0,6,2]
[null,null,23,23,null,1,{"$f":"SUM(G4:G14)","v":108},{"$f":"IF(ISERROR(G16/D16),\"\",G16/D16)","v":4.6956521739130439},null,{"$f":"SUM(J4:J15)","v":6},{"$f":"SUM(K4:K15)","v":1},null,"2011-12-08","De Cupmaten - De Kempen (BK)",1,0,0,7,2,5,1,0,0,7,2,0,0,0,0,0]
[null,null,null,null,null,null,null,null,null,null,null,null,"2011-12-14","P&V Turnhout - De Cupmaten ",0,1,0,7,7,0,0,0,0,0,0,0,1,0,7,7]
[null,"Beker",null,null,null,null,null,null,null,null,null,null,"2011-12-22","De Cupmaten - Montana",0,0,1,1,5,-4,0,0,1,1,5,0,0,0,0,0]
[null,null,null,null,null,null,null,null,null,null,null,null,"2012-01-11","Supraboys - De Cupmaten",1,0,0,3,2,1,0,0,0,0,0,1,0,0,3,2]
[null,"Speler","Aanwezig","Matchen","Afvaller","Forfait","Doelpunten","Gem doelp.","% aandeel","Geel","Rood",null,"2012-01-19","De Cupmaten – Arendonk",0,0,1,5,10,-5,0,0,1,5,10,0,0,0,0,0]
[null,"De Decker Guy",2,2,null,null,null,{"$f":"IF(ISERROR(G21/D21),\"\",G21/D21)","v":0},{"$f":"IF(ISERROR($G21/$G$33),\"\",$G21/$G$33)","v":0},0,0,null,"2012-01-23","Montana - De Cupmaten",0,0,1,2,7,-5,0,0,0,0,0,0,0,1,2,7]
[null,"Lenaerts Jaan",1,1,null,null,null,{"$f":"IF(ISERROR(G22/D22),\"\",G22/D22)","v":0},{"$f":"IF(ISERROR($G22/$G$33),\"\",$G22/$G$33)","v":0},0,0,null,"2012-02-02","De Cupmaten - Boost",1,0,0,6,5,1,1,0,0,6,5,0,0,0,0,0]
[null,"De Decker Koen",2,2,null,null,1,0.5,9.0909090909090912E-2,0,0,null,"2012-02-08","Boomerangs B - De Cupmaten",0,0,1,3,5,-2,0,0,0,0,0,0,0,1,3,5]
[null,"Van Gils Bart",1,1,null,null,4,4,0.36363636363636365,0,0,null,"2012-02-23","De Cupmaten - De Ster",0,0,1,6,10,-4,0,0,1,6,10,0,0,0,0,0]
[null,"Vajda Dierckx Davy",null,null,null,null,null,"",{"$f":"IF(ISERROR($G25/$G$33),\"\",$G25/$G$33)","v":0},0,0,null,"2012-03-08","De Cupmaten - Biljart Palace",1,0,0,13,3,10,1,0,0,13,3,0,0,0,0,0]
[null,"De Decker Hans",2,2,null,null,1,0.5,9.0909090909090912E-2,0,0,null,"2012-03-14","KDS. Turnhout- De Cupmaten ",1,0,0,8,4,4,0,0,0,0,0,1,0,0,8,4]
[null,"Daemen Jan",null,null,null,null,null,"",0,0,0,null,"2012-03-22","De Cupmaten - De Sjepap",0,0,1,1,6,-5,0,0,1,1,6,0,0,0,0,0]
[null,"Van Dijck Vincent",2,2,null,null,2,{"$f":"IF(ISERROR(G28/D28),\"\",G28/D28)","v":1},0.18181818181818182,0,0,null,"2012-03-28","Vijfde Wiel - De Cupmaten ",0,1,0,4,4,0,0,0,0,0,0,0,1,0,4,4]
[null,"Westhof Jan",2,2,null,null,1,0.5,9.0909090909090912E-2,0,0,null,"2012-04-12","De Cupmaten - P&V Turnhout",0,0,1,1,8,-7,0,0,1,1,8,0,0,0,0,0]
[null,"Dom Steven",2,2,null,null,2,1,0.18181818181818182,0,0,null,"2012-04-25","Hoek Van Portugal - De Cupmaten",1,0,0,7,4,3,0,0,0,0,0,1,0,0,7,4]
[null,"Daemen Geert-Jan",1,1,null,null,null,0,{"$f":"IF(ISERROR($G31/$G$33),\"\",$G31/$G$33)","v":0},0,0,null,"Totaal",null,{"$f":"SUM(O5:O30)","v":10},{"$f":"SUM(P5:P30)","v":2},14,128,149,-21,6,0,7,67,70,4,2,7,61,{"$f":"SUM(AD5:AD30)","v":79}]
[]
[null,null,2,2,null,0,{"$f":"SUM(G21:G31)","v":11},{"$f":"IF(ISERROR(G33/D33),\"\",G33/D33)","v":5.5},null,{"$f":"SUM(J21:J32)","v":0},{"$f":"SUM(K21:K32)","v":0},null,null,"Gemiddelde",{"$f":"IF(ISERROR(O$31/($O$31+$P$31+$Q$31)),\"\",O$31/($O$31+$P$31+$Q$31))","v":0.38461538461538464},{"$f":"IF(ISERROR(P$31/($O$31+$P$31+$Q$31)),\"\",P$31/($O$31+$P$31+$Q$31))","v":7.6923076923076927E-2},0.53846153846153844,{"$f":"IF(ISERROR(R$31/($O$31+$P$31+$Q$31)),\"\",R$31/($O$31+$P$31+$Q$31))","v":4.9230769230769234},{"$f":"IF(ISERROR(S$31/($O$31+$P$31+$Q$31)),\"\",S$31/($O$31+$P$31+$Q$31))","v":5.7307692307692308},-0.80769230769230771,{"$f":"IF(ISERROR(U$31/($U$31+$V$31+$W$31)),\"\",U$31/($U$31+$V$31+$W$31))","v":0.46153846153846156},{"$f":"IF(ISERROR(V$31/($U$31+$V$31+$W$31)),\"\",V$31/($U$31+$V$31+$W$31))","v":0},0.53846153846153844,{"$f":"IF(ISERROR(X$31/($U$31+$V$31+$W$31)),\"\",X$31/($U$31+$V$31+$W$31))","v":5.1538461538461542},{"$f":"IF(ISERROR(Y$31/($U$31+$V$31+$W$31)),\"\",Y$31/($U$31+$V$31+$W$31))","v":5.384615384615385},{"$f":"IF(ISERROR(Z$31/($Z$31+$AA$31+$AB$31)),\"\",Z$31/($Z$31+$AA$31+$AB$31))","v":0.30769230769230771},{"$f":"IF(ISERROR(AA$31/($Z$31+$AA$31+$AB$31)),\"\",AA$31/($Z$31+$AA$31+$AB$31))","v":0.15384615384615385},0.53846153846153844,{"$f":"IF(ISERROR(AC$31/($Z$31+$AA$31+$AB$31)),\"\",AC$31/($Z$31+$AA$31+$AB$31))","v":4.6923076923076925},{"$f":"IF(ISERROR(AD$31/($Z$31+$AA$31+$AB$31)),\"\",AD$31/($Z$31+$AA$31+$AB$31))","v":6.0769230769230766}]
[]
[null,"Totaal"]
[]
[null,"Speler","Aanwezig","Matchen","Afvaller","Forfait","Doelpunten","Gem doelp.","% aandeel","Geel","Rood"]
[{"$f":"$G38-$G38/100+(D38/100)-0.06","v":0.1},"De Decker Guy",{"$f":"C21+C4","v":17},16,1,0,0,{"$f":"IF(ISERROR(G38/D38),\"\",G38/D38)","v":0},{"$f":"IF(ISERROR($G38/$G$50),\"\",$G38/$G$50)","v":0},{"$f":"J4+J21","v":0},0]
[{"$f":"$G39-$G39/100+(D39/100)","v":7.0000000000000007E-2},"Lenaerts Jaan",7,7,0,0,0,{"$f":"IF(ISERROR(G39/D39),\"\",G39/D39)","v":0},{"$f":"IF(ISERROR($G39/$G$50),\"\",$G39/$G$50)","v":0},0,0]
[{"$f":"$G40-$G40/100+(D40/100)-0.055","v":3.085},"De Decker Koen",18,17,1,0,3,0.17647058823529413,2.5210084033613446E-2,1,0]
[{"$f":"$G41-$G41/100+(D41/100)-0.07","v":19.93},"Van Gils Bart",20,20,0,0,20,1,0.16806722689075632,2,0]
[{"$f":"$G42-$G42/100+(D42/100)-0.085","v":11.904999999999999},"Vajda Dierckx Davy",12,11,1,0,12,1.0909090909090908,0.10084033613445378,0,0]
[{"$f":"$G43-$G43/100+(D43/100)-0.02","v":9.120000000000001},"De Decker Hans",23,23,0,0,9,0.39130434782608697,7.5630252100840331E-2,2,1]
[{"$f":"$G44-$G44/100+(D44/100)-0.1","v":0.97000000000000008},"Daemen Jan",8,8,0,0,1,0.125,8.4033613445378148E-3,0,0]
[{"$f":"$G45-$G45/100+(D45/100)-0.04","v":10.070000000000002},"Van Dijck Vincent",22,21,1,0,10,0.47619047619047616,8.4033613445378158E-2,0,0]
[{"$f":"$G46-$G46/100+(D46/100)-0.03","v":12.080000000000002},"Westhof Jan",24,{"$f":"D29+D12","v":23},1,0,12,0.52173913043478259,0.10084033613445378,0,0]
[{"$f":"$G47-$G47/100+(D47/100)-0.01","v":39.840000000000003},"Dom Steven",25,{"$f":"D30+D13","v":25},0,0,40,1.6,0.33613445378151263,1,0]
[{"$f":"$G48-$G48/100+(D48/100)","v":12.06},"Daemen Geert-Jan",19,18,1,0,12,{"$f":"IF(ISERROR(G48/D48),\"\",G48/D48)","v":0.66666666666666663},0.10084033613445378,0,0]
[]
[null,null,{"$f":"C33+C16","v":25},{"$f":"D16+D33","v":25},null,{"$f":"F16+F33","v":1},{"$f":"SUM(G38:G48)","v":119},{"$f":"IF(ISERROR(G50/D50),\"\",G50/D50)","v":4.76},null,{"$f":"SUM(J38:J49)","v":6},{"$f":"SUM(K38:K49)","v":1}]
[]
[null,"Totaal"]
[null,null,null,null,null,null,null,null,null,null,null,null,null,null,null,null,null,"Forfait"]
[null,"Speler","Aanwezig","Matchen","Afvaller","Forfait","Doelpunten","Gem doelp.","% aandeel","Geel","Rood",null,"Eindklassement"]
[{"$f":"LARGE($A$38:$A$48,ROW(A1))","v":39.840000000000003},{"$f":"VLOOKUP($A55,$A$38:$K$48,COLUMN(B1),FALSE)","v":"Dom Steven"},25,25,0,0,40,1.6,0.33613445378151263,1,0]
[19.93,{"$f":"VLOOKUP($A56,$A$38:$K$48,COLUMN(B2),FALSE)","v":"Van Gils Bart"},{"$f":"VLOOKUP($A56,$A$38:$K$48,COLUMN(C2),FALSE)","v":20},20,0,0,20,1,0.16806722689075632,2,0,null,null,"Ploeg","Winst","Gelijk","Verlies","Voor ","Tegen","DS","Punten"]
[12.080000000000002,{"$f":"VLOOKUP($A57,$A$38:$K$48,COLUMN(B3),FALSE)","v":"Westhof Jan"},{"$f":"VLOOKUP($A57,$A$38:$K$48,COLUMN(C3),FALSE)","v":24},23,1,0,12,0.52173913043478259,0.10084033613445378,0,0,null,1,"Montana",23,1,0,248,41,207,70]
[12.06,{"$f":"VLOOKUP($A58,$A$38:$K$48,COLUMN(B4),FALSE)","v":"Daemen Geert-Jan"},{"$f":"VLOOKUP($A58,$A$38:$K$48,COLUMN(C4),FALSE)","v":19},18,1,0,12,0.66666666666666663,0.10084033613445378,0,0,null,2,"De Ster",19,0,5,178,71,107,57]
[11.904999999999999,{"$f":"VLOOKUP($A59,$A$38:$K$48,COLUMN(B5),FALSE)","v":"Vajda Dierckx Davy"},{"$f":"VLOOKUP($A59,$A$38:$K$48,COLUMN(C5),FALSE)","v":12},11,1,0,12,1.0909090909090908,0.10084033613445378,0,0,null,3,"De Sjepap",17,1,6,193,95,98,52]
[10.070000000000002,{"$f":"VLOOKUP($A60,$A$38:$K$48,COLUMN(B6),FALSE)","v":"Van Dijck Vincent"},22,21,1,0,10,0.47619047619047616,8.4033613445378158E-2,0,0,null,4,"Arendonk",16,3,5,158,89,69,51]
[9.120000000000001,"De Decker Hans",23,23,0,0,9,0.39130434782608697,7.5630252100840331E-2,2,1,null,5,"P&V Turnhout",16,2,6,181,78,103,50]
[3.085,"De Decker Koen",18,17,1,0,3,0.17647058823529413,2.5210084033613446E-2,1,0,null,6,"Hoek Van Portugal",12,4,8,155,79,76,40]
[0.97000000000000008,{"$f":"VLOOKUP($A63,$A$38:$K$48,COLUMN(B9),FALSE)","v":"Daemen Jan"},{"$f":"VLOOKUP($A63,$A$38:$K$48,COLUMN(C9),FALSE)","v":8},8,0,0,1,0.125,8.4033613445378148E-3,0,0,null,7,"Boost",11,2,11,166,130,36,35]
[0.1,{"$f":"VLOOKUP($A64,$A$38:$K$48,COLUMN(B10),FALSE)","v":"De Decker Guy"},{"$f":"VLOOKUP($A64,$A$38:$K$48,COLUMN(C10),FALSE)","v":17},16,1,0,0,0,0,0,0,null,8,"De Cupmaten",9,2,13,117,141,-24,29]
[7.0000000000000007E-2,{"$f":"VLOOKUP($A65,$A$38:$K$48,COLUMN(B11),FALSE)","v":"Lenaerts Jaan"},{"$f":"VLOOKUP($A65,$A$38:$K$48,COLUMN(C11),FALSE)","v":7},7,0,0,0,0,0,0,0,null,9,"Supraboys",8,2,14,122,141,-19,26]
[null,null,null,null,null,null,null,null,null,null,null,null,10,"Vijfde Wiel",6,2,16,110,156,-46,20]
[null,null,{"$f":"C50","v":25},{"$f":"D50","v":25},null,{"$f":"F50","v":1},{"$f":"G50","v":119},{"$f":"IF(ISERROR(G67/D67),\"\",G67/D67)","v":4.76},null,{"$f":"J50","v":6},{"$f":"K50","v":1},null,11,"KDS. Turnhout",5,1,18,82,178,-96,16]
[null,null,null,null,null,null,null,null,null,null,null,null,12,"Boomerangs B",3,0,21,81,309,-228,9]
[null,null,null,null,null,null,null,null,null,null,null,null,13,"Biljart Palace",1,0,23,74,357,-283,3]

{"sheet":"Seizoen 2012-2013 ","index":3,"n_rows":75,"n_cols":30,"rows_kept":75,"cut":false,"hidden":false,"merged":[[1,20,1,24],[1,25,1,29],[2,20,2,24],[2,25,2,29]]}
[null,"Competitie",null,null,null,null,null,null,null,null,null,null,"Wedstrijden"]
[]
[null,"Speler","Aanwezig","Matchen","Afvaller","Forfait","Doelpunten","Gem doelp.","% aandeel","Geel","Rood",null,null,null,null,null,null,null,null,null,"Thuis",null,null,null,null,"Uit"]
[null,"De Decker Guy",6,5,null,null,null,{"$f":"IF(ISERROR(G4/D4),\"\",G4/D4)","v":0},{"$f":"IF(ISERROR($G4/$G$18),\"\",$G4/$G$18)","v":0},0,0,null,"Datum","Wedstrijd","Winst","Gelijk","Verlies","Voor ","Tegen","DS","Winst","Gelijk","Verlies","Voor ","Tegen","Winst","Gelijk","Verlies","Voor ","Tegen"]
[null,"Lenaerts Jaan",null,null,null,null,null,"",0,0,0,null,"2012-09-05","HVP United - De Cupmaten",{"$f":"U5+Z5","v":0},0,{"$f":"W5+AB5","v":1},{"$f":"X5+AC5","v":4},{"$f":"Y5+AD5","v":16},{"$f":"R5-S5","v":-12},0,0,0,0,0,0,0,1,4,16]
[null,"De Decker Koen",15,14,1,null,4,{"$f":"IF(ISERROR(G6/D6),\"\",G6/D6)","v":0.2857142857142857},5.128205128205128E-2,0,0,null,"2012-09-14","De Brouwerij - De Cupmaten",{"$f":"U6+Z6","v":0},{"$f":"V6+AA6","v":0},{"$f":"W6+AB6","v":1},{"$f":"X6+AC6","v":0},{"$f":"Y6+AD6","v":5},{"$f":"R6-S6","v":-5},0,0,0,0,0,0,0,1,0,5]
[null,"Van Gils Bart",13,12,1,null,15,{"$f":"IF(ISERROR(G7/D7),\"\",G7/D7)","v":1.25},0.19230769230769232,0,0,null,"2012-09-17","Giel - De Cupmaten (BK)",0,0,1,{"$f":"X7+AC7","v":1},9,-8,0,0,0,0,0,0,0,1,1,9]
[null,"Vajda Dierckx Davy",9,7,1,null,8,{"$f":"IF(ISERROR(G8/D8),\"\",G8/D8)","v":1.1428571428571428},0.10256410256410256,0,0,null,"2012-09-27","De Cupmaten - Vijfde Wiel",0,0,1,3,4,-1,0,0,1,3,4,0,0,0,0,0]
[null,"De Decker Hans",14,6,1,null,2,0.33333333333333331,2.564102564102564E-2,1,0,null,"2012-10-11","De Cupmaten - Supraboys",1,0,0,5,4,1,1,0,0,5,4,0,0,0,0,0]
[null,"Daemen Jan",11,7,4,null,null,0,0,0,0,null,"2012-10-19","The Young Ones - De Cupmaten",0,0,1,1,3,-2,0,0,0,0,0,0,0,1,1,3]
[null,"Van Dijck Vincent",10,10,null,null,null,0,0,0,0,null,"2012-11-15","De Cupmaten - Boomerangs B",1,0,0,20,2,18,1,0,0,20,2,0,0,0,0,0]
[null,"Westhof Jan",15,15,null,null,10,0.66666666666666663,0.12820512820512819,0,0,null,"2012-11-30","De Bergen B - De Cupmaten",1,0,0,11,1,10,0,0,0,0,0,1,0,0,11,1]
[null,"Dom Steven",14,12,null,null,18,{"$f":"IF(ISERROR(G13/D13),\"\",G13/D13)","v":1.5},0.23076923076923078,1,0,null,"2012-12-05","Atlaslions A - De Cupmaten (BK)",0,0,1,2,8,-6,0,0,0,0,0,0,0,1,2,8]
[null,"Burreddu Efisio",6,5,1,null,6,{"$f":"IF(ISERROR(G14/D14),\"\",G14/D14)","v":1.2},7.6923076923076927E-2,0,0,null,"2012-12-13","De Cupmaten - Den Toren (BK)",{"$f":"U14+Z14","v":0},{"$f":"V14+AA14","v":0},{"$f":"W14+AB14","v":1},{"$f":"X14+AC14","v":3},{"$f":"Y14+AD14","v":4},{"$f":"R14-S14","v":-1},0,0,1,3,4,0,0,0,0,0]
[null,"Bloemen Bart",14,14,null,null,5,{"$f":"IF(ISERROR(G15/D15),\"\",G15/D15)","v":0.35714285714285715},6.4102564102564097E-2,0,0,null,"2012-12-17","Het vervolg - De Cupmaten",0,0,1,5,7,-2,0,0,0,0,0,0,0,1,5,7]
[null,"Daemen Geert-Jan",12,10,null,null,10,{"$f":"IF(ISERROR(G16/D16),\"\",G16/D16)","v":1},0.12820512820512819,1,0,null,"2013-01-17","De Cupmaten - De Brouwerij",0,0,1,1,10,-9,0,0,1,1,10,0,0,0,0,0]
[null,null,null,null,null,null,null,null,null,null,null,null,"2013-01-23","Boomerangs B - De Cupmaten",1,0,0,3,1,2,0,0,0,0,0,1,0,0,3,1]
[null,null,16,16,null,0,{"$f":"SUM(G4:G16)","v":78},{"$f":"IF(ISERROR(G18/D18),\"\",G18/D18)","v":4.875},null,{"$f":"SUM(J4:J17)","v":3},{"$f":"SUM(K4:K17)","v":0},null,"2013-02-07","De Cupmaten - Het Vervolg",0,0,1,3,6,-3,0,0,1,3,6,0,0,0,0,0]
[null,null,null,null,null,null,null,null,null,null,null,null,"2013-02-28","De Cupmaten - The Young Ones",0,0,1,4,8,-4,0,0,1,4,8,0,0,0,0,0]
[null,"Beker",null,null,null,null,null,null,null,null,null,null,"2013-03-06","Vijfde Wiel - De Cupmaten",0,0,1,3,9,-6,0,0,0,0,0,0,0,1,3,9]
[null,null,null,null,null,null,null,null,null,null,null,null,"2013-03-28","De Cupmaten - De Bergen B",1,0,0,10,0,10,1,0,0,10,0,0,0,0,0,0]
[null,"Speler","Aanwezig","Matchen","Afvaller","Forfait","Doelpunten","Gem doelp.","% aandeel","Geel","Rood",null,"2013-04-04","De Cupmaten - HVP United",0,0,1,2,7,-5,0,0,1,2,7,0,0,0,0,0]
[null,"De Decker Guy",2,2,null,null,null,{"$f":"IF(ISERROR(G23/D23),\"\",G23/D23)","v":0},{"$f":"IF(ISERROR($G23/$G$37),\"\",$G23/$G$37)","v":0},0,0,null,"2013-04-17","Supraboys - De Cupmaten",1,0,0,4,3,1,0,0,0,0,0,1,0,0,4,3]
[null,"Lenaerts Jaan",null,null,null,null,null,{"$f":"IF(ISERROR(G24/D24),\"\",G24/D24)","v":""},0,0,0]
[null,"De Decker Koen",1,1,null,null,1,1,0.16666666666666666,0,0,null,"Totaal",null,{"$f":"SUM(O5:O24)","v":6},0,13,85,107,-22,3,0,6,51,45,3,0,7,34,62]
[null,"Van Gils Bart",2,2,null,null,null,0,0,0,0]
[null,"Vajda Dierckx Davy",2,2,null,null,1,0.5,0.16666666666666666,0,0,null,null,"Gemiddelde",{"$f":"IF(ISERROR(O$25/($O$25+$P$25+$Q$25)),\"\",O$25/($O$25+$P$25+$Q$25))","v":0.31578947368421051},0,0.68421052631578949,4.4736842105263159,5.6315789473684212,-1.1578947368421053,{"$f":"IF(ISERROR(U$25/($U$25+$V$25+$W$25)),\"\",U$25/($U$25+$V$25+$W$25))","v":0.33333333333333331},{"$f":"IF(ISERROR(V$25/($U$25+$V$25+$W$25)),\"\",V$25/($U$25+$V$25+$W$25))","v":0},{"$f":"IF(ISERROR(W$25/($U$25+$V$25+$W$25)),\"\",W$25/($U$25+$V$25+$W$25))","v":0.66666666666666663},{"$f":"IF(ISERROR(X$25/($U$25+$V$25+$W$25)),\"\",X$25/($U$25+$V$25+$W$25))","v":5.666666666666667},{"$f":"IF(ISERROR(Y$25/($U$25+$V$25+$W$25)),\"\",Y$25/($U$25+$V$25+$W$25))","v":5},{"$f":"IF(ISERROR(Z$25/($Z$25+$AA$25+$AB$25)),\"\",Z$25/($Z$25+$AA$25+$AB$25))","v":0.3},{"$f":"IF(ISERROR(AA$25/($Z$25+$AA$25+$AB$25)),\"\",AA$25/($Z$25+$AA$25+$AB$25))","v":0},{"$f":"IF(ISERROR(AB$25/($Z$25+$AA$25+$AB$25)),\"\",AB$25/($Z$25+$AA$25+$AB$25))","v":0.7},{"$f":"IF(ISERROR(AC$25/($Z$25+$AA$25+$AB$25)),\"\",AC$25/($Z$25+$AA$25+$AB$25))","v":3.4},{"$f":"IF(ISERROR(AD$25/($Z$25+$AA$25+$AB$25)),\"\",AD$25/($Z$25+$AA$25+$AB$25))","v":6.2}]
[null,"De Decker Hans",2,1,null,null,null,0,0,0,0]
[null,"Daemen Jan",1,1,null,null,null,0,0,0,0]
[null,"Van Dijck Vincent",1,1,null,null,null,0,0,0,0]
[null,"Westhof Jan",2,2,null,null,1,0.5,0.16666666666666666,0,0]
[null,"Dom Steven",2,2,null,null,null,0,0,0,0]
[null,"Burreddu Efisio",null,null,null,null,null,null,0,0,0]
[null,"Bloemen Bart",2,2,null,null,3,1.5,{"$f":"IF(ISERROR($G34/$G$37),\"\",$G34/$G$37)","v":0.5},0,0]
[null,"Daemen Geert-Jan",1,1,null,null,null,{"$f":"IF(ISERROR(G35/D35),\"\",G35/D35)","v":0},{"$f":"IF(ISERROR($G35/$G$37),\"\",$G35/$G$37)","v":0},0,0]
[]
[null,null,3,3,null,0,{"$f":"SUM(G23:G35)","v":6},{"$f":"IF(ISERROR(G37/D37),\"\",G37/D37)","v":2},null,{"$f":"SUM(J23:J36)","v":0},{"$f":"SUM(K23:K36)","v":0}]
[]
[null,"Totaal"]
[]
[null,"Speler","Aanwezig","Matchen","Afvaller","Forfait","Doelpunten","Gem doelp.","% aandeel","Geel","Rood"]
[{"$f":"$G42-$G42/100+(D42/100)","v":7.0000000000000007E-2},"De Decker Guy",{"$f":"C23+C4","v":8},7,0,0,0,{"$f":"IF(ISERROR(G42/D42),\"\",G42/D42)","v":0},{"$f":"IF(ISERROR($G42/$G$56),\"\",$G42/$G$56)","v":0},{"$f":"J4+J23","v":0},0]
[{"$f":"$G43-$G43/100+(D43/100)-1","v":-1},"Lenaerts Jaan",0,0,0,0,0,{"$f":"IF(ISERROR(G43/D43),\"\",G43/D43)","v":""},0,0,0]
[{"$f":"$G44-$G44/100+(D44/100)-0.01","v":5.0900000000000007},"De Decker Koen",16,15,1,0,5,0.33333333333333331,5.9523809523809521E-2,0,0]
[{"$f":"$G45-$G45/100+(D45/100)-0.11","v":14.88},"Van Gils Bart",15,14,1,0,15,1.0714285714285714,0.17857142857142858,0,0]
[{"$f":"$G46-$G46/100+(D46/100)-0.04","v":8.9600000000000009},"Vajda Dierckx Davy",11,9,1,0,9,1,0.10714285714285714,0,0]
[{"$f":"$G47-$G47/100+(D47/100)-0.09","v":1.9599999999999997},"De Decker Hans",16,7,1,0,2,0.2857142857142857,2.3809523809523808E-2,1,0]
[{"$f":"$G48-$G48/100+(D48/100)-0.08","v":0},"Daemen Jan",12,8,4,0,0,0,0,0,0]
[{"$f":"$G49-$G49/100+(D49/100)-0.07","v":3.9999999999999994E-2},"Van Dijck Vincent",11,11,0,0,0,0,0,0,0,null,null,null,null,null,null,"Forfait"]
[{"$f":"$G50-$G50/100+(D50/100)","v":11.06},"Westhof Jan",17,17,0,0,11,0.6470588235294118,0.13095238095238096,0,0]
[{"$f":"$G51-$G51/100+(D51/100)","v":17.96},"Dom Steven",16,14,0,0,18,1.2857142857142858,0.21428571428571427,1,0]
[{"$f":"$G52-$G52/100+(D52/100)","v":5.99},"Burreddu Efisio",{"$f":"C33+C14","v":6},{"$f":"D33+D14","v":5},{"$f":"E33+E14","v":1},{"$f":"F33+F14","v":0},{"$f":"G33+G14","v":6},1.2,7.1428571428571425E-2,{"$f":"J33+J14","v":0},{"$f":"K33+K14","v":0}]
[{"$f":"$G53-$G53/100+(D53/100)","v":8.08},"Bloemen Bart",{"$f":"C34+C15","v":16},16,0,0,8,0.5,9.5238095238095233E-2,{"$f":"J34+J15","v":0},{"$f":"K34+K15","v":0}]
[{"$f":"$G54-$G54/100+(D54/100)","v":10.01},"Daemen Geert-Jan",{"$f":"C35+C16","v":13},11,0,0,10,{"$f":"IF(ISERROR(G54/D54),\"\",G54/D54)","v":0.90909090909090906},0.11904761904761904,{"$f":"J16+J35","v":1},0]
[]
[null,null,{"$f":"C37+C18","v":19},{"$f":"D18+D37","v":19},null,{"$f":"F18+F37","v":0},{"$f":"SUM(G42:G54)","v":84},{"$f":"IF(ISERROR(G56/D56),\"\",G56/D56)","v":4.4210526315789478},null,{"$f":"SUM(J42:J55)","v":3},{"$f":"SUM(K42:K55)","v":0}]
[]
[null,"Totaal"]
[]
[null,"Speler","Aanwezig","Matchen","Afvaller","Forfait","Doelpunten","Gem doelp.","% aandeel","Geel","Rood",null,"Eindklassement"]
[{"$f":"LARGE($A$42:$A$54,ROW(A1))","v":17.96},{"$f":"VLOOKUP($A61,$A$42:$K$54,COLUMN(B1),FALSE)","v":"Dom Steven"},16,14,0,0,18,1.2857142857142858,0.21428571428571427,1,0]
[14.88,{"$f":"VLOOKUP($A62,$A$42:$K$54,COLUMN(B2),FALSE)","v":"Van Gils Bart"},{"$f":"VLOOKUP($A62,$A$42:$K$54,COLUMN(C2),FALSE)","v":15},14,1,0,15,1.0714285714285714,0.17857142857142858,0,0,null,null,"Ploeg","Winst","Gelijk","Verlies","Voor ","Tegen","DS","Punten"]
[11.06,"Westhof Jan",{"$f":"VLOOKUP($A63,$A$42:$K$54,COLUMN(C3),FALSE)","v":17},17,0,0,11,0.6470588235294118,0.13095238095238096,0,0,null,1,"De Brouwerij",13,3,0,155,42,113,42]
[10.01,"Daemen Geert-Jan",{"$f":"VLOOKUP($A64,$A$42:$K$54,COLUMN(C4),FALSE)","v":13},11,0,0,10,0.90909090909090906,0.11904761904761904,1,0,null,2,"HVP United",13,2,1,142,38,104,41]
[8.9600000000000009,"Vajda Dierckx Davy",{"$f":"VLOOKUP($A65,$A$42:$K$54,COLUMN(C5),FALSE)","v":11},9,1,0,9,1,0.10714285714285714,0,0,null,3,"The Young Ones",12,0,4,117,57,60,36]
[8.08,"Bloemen Bart",{"$f":"VLOOKUP($A66,$A$42:$K$54,COLUMN(C6),FALSE)","v":16},16,0,0,8,0.5,9.5238095238095233E-2,0,0,null,4,"Het Vervolg",9,2,5,124,87,37,29]
[5.99,"Burreddu Efisio",{"$f":"VLOOKUP($A67,$A$42:$K$54,COLUMN(C7),FALSE)","v":6},5,1,0,6,1.2,7.1428571428571425E-2,0,0,null,5,"Vijfde Wiel",7,1,8,84,93,-9,22]
[5.0900000000000007,"De Decker Koen",{"$f":"VLOOKUP($A68,$A$42:$K$54,COLUMN(C8),FALSE)","v":16},15,1,0,5,0.33333333333333331,5.9523809523809521E-2,0,0,null,6,"De Cupmaten",6,0,10,79,86,-7,18]
[1.9599999999999997,"De Decker Hans",{"$f":"VLOOKUP($A69,$A$42:$K$54,COLUMN(C9),FALSE)","v":16},7,1,0,2,0.2857142857142857,2.3809523809523808E-2,1,0,null,7,"Supraboys",4,0,12,69,107,-38,12]
[7.0000000000000007E-2,"De Decker Guy",{"$f":"VLOOKUP($A70,$A$42:$K$54,COLUMN(C10),FALSE)","v":8},7,0,0,0,0,0,0,0,null,8,"Boomerangs B",2,0,14,41,248,-207,6]
[3.9999999999999994E-2,"Van Dijck Vincent",{"$f":"VLOOKUP($A71,$A$42:$K$54,COLUMN(C11),FALSE)","v":11},11,0,0,0,0,0,0,0,null,9,"De Bergen B",1,2,13,52,105,-53,5]
[0,"Daemen Jan",{"$f":"VLOOKUP($A72,$A$42:$K$54,COLUMN(C12),FALSE)","v":12},8,4,0,0,0,0,0,0]
[-1,"Lenaerts Jaan",0,0,0,0,0,"",0,0,0]
[]
[null,null,{"$f":"C56","v":19},{"$f":"D56","v":19},null,{"$f":"F56","v":0},{"$f":"G56","v":84},{"$f":"IF(ISERROR(G75/D75),\"\",G75/D75)","v":4.4210526315789478},null,{"$f":"J56","v":3},{"$f":"K56","v":0}]

{"sheet":"Seizoen 2013-2014  ","index":4,"n_rows":70,"n_cols":31,"rows_kept":70,"cut":false,"hidden":false,"merged":[[1,20,1,24],[1,25,1,29]]}
[null,"Competitie",null,null,null,null,null,null,null,null,null,null,"Wedstrijden"]
[null,null,null,null,null,null,null,null,null,null,null,null,null,null,null,null,null,null,null,null,"Thuis",null,null,null,null,"Uit"]
[null,"Speler","Aanwezig","Matchen","Afvaller","Forfait","Doelpunten","Gem doelp.","% aandeel","Geel","Rood",null,"Datum","Wedstrijd","Winst","Gelijk","Verlies","Voor ","Tegen","DS","Winst","Gelijk","Verlies","Voor ","Tegen","Winst","Gelijk","Verlies","Voor ","Tegen"]
[null,"De Decker Guy",8,4,null,null,null,{"$f":"IF(ISERROR(G4/D4),\"\",G4/D4)","v":0},{"$f":"IF(ISERROR($G4/$G$17),\"\",$G4/$G$17)","v":0},0,0,null,"2013-09-20","Verschilboys B - De Cupmaten",{"$f":"U4+Z4","v":0},0,{"$f":"$W4+$AB4","v":1},{"$f":"$X4+$AC4","v":2},{"$f":"$Y4+$AD4","v":4},{"$f":"$R4-$S4","v":-2},0,0,0,0,0,0,0,1,2,4]
[null,"De Decker Koen",13,12,1,null,1,{"$f":"IF(ISERROR(G5/D5),\"\",G5/D5)","v":8.3333333333333329E-2},1.5384615384615385E-2,0,0,null,"2013-09-26","De Cupmaten - Rima Sportif B",{"$f":"U5+Z5","v":0},{"$f":"V5+AA5","v":1},0,3,3,0,{"$f":"AA5+AF37","v":0},1,0,3,3,0,{"$f":"AG5+AL5","v":0},0,0,0]
[null,"Van Gils Bart",13,12,null,null,8,{"$f":"IF(ISERROR(G6/D6),\"\",G6/D6)","v":0.66666666666666663},0.12307692307692308,0,0,null,"2013-09-30","Roosen - De Cupmaten (BK)",1,0,0,6,1,5,{"$f":"AA6+AF38","v":0},{"$f":"AB6+AG6","v":0},0,0,0,1,0,0,6,1]
[null,"Vajda Dierckx Davy",10,8,1,null,3,{"$f":"IF(ISERROR(G7/D7),\"\",G7/D7)","v":0.375},4.6153846153846156E-2,1,0,null,"2013-10-17","De Cupmaten - Supraboys",1,0,0,3,2,1,1,0,0,3,2,0,0,0,0,0]
[null,"De Decker Hans",15,14,null,null,8,0.5714285714285714,0.12307692307692308,0,0,null,"2013-10-30","Boomerangs B - De Cupmaten",1,0,0,10,4,6,{"$f":"AA8+AF40","v":0},0,0,0,0,1,0,0,10,4,"* 1 owngoal "]
[null,"Daemen Jan",12,6,2,null,null,0,0,0,0,null,"2013-11-06","A.S. Fortuna - De Cupmaten",1,0,0,6,1,5,{"$f":"AA9+AF41","v":0},0,0,0,0,1,0,0,6,1,"* 1 owngoal "]
[null,"Van Dijck Vincent",10,9,null,null,1,0.1111111111111111,1.5384615384615385E-2,0,0,null,"2013-11-14","De Cupmaten - Roosen",1,0,0,3,1,2,1,0,0,3,1,0,0,0,0,0,"* 1 owngoal "]
[null,"Westhof Jan",15,14,1,null,17,1.2142857142857142,0.26153846153846155,1,0,null,"2013-11-20","Youngsters - De Cupmaten",0,0,1,3,6,-3,{"$f":"AA11+AF43","v":0},1,0,0,0,0,0,1,3,6]
[null,"Dom Steven",16,16,null,null,20,{"$f":"IF(ISERROR(G12/D12),\"\",G12/D12)","v":1.25},0.30769230769230771,0,0,null,"2013-11-28","De Cupmaten  -Lierseweg (BK)",0,0,1,5,6,-1,{"$f":"AA12+AF44","v":0},1,0,0,0,0,0,1,5,6]
[null,"Bloemen Bart",7,7,null,null,1,{"$f":"IF(ISERROR(G13/D13),\"\",G13/D13)","v":0.14285714285714285},1.5384615384615385E-2,1,0,null,"2013-12-02","Roma - De Cupmaten (BK)",0,0,1,3,5,-2,0,0,0,0,0,0,0,1,3,5]
[null,"Daemen Geert-Jan",14,12,1,null,6,{"$f":"IF(ISERROR(G14/D14),\"\",G14/D14)","v":0.5},9.2307692307692313E-2,0,0,null,"2013-12-12","De Cupmaten - Vijfde Wiel",0,0,1,1,5,-4,{"$f":"AA14+AF46","v":0},{"$f":"AB14+AG13","v":0},1,1,5,0,{"$f":"AG13+AL13","v":0},{"$f":"AH13+AM13","v":0},0,0]
[null,"Daemen Martijn",3,3,null,null,null,{"$f":"IF(ISERROR(G15/D15),\"\",G15/D15)","v":0},0,0,0,null,"2014-01-09","De Cupmaten - De Fuik (BK)",{"$f":"U15+Z15","v":0},1,{"$f":"$W15+$AB15","v":0},{"$f":"$X15+$AC15","v":2},{"$f":"$Y15+$AD15","v":2},{"$f":"$R15-$S15","v":0},{"$f":"AA15+AF47","v":0},1,0,2,2,0,{"$f":"AG14+AL14","v":0},{"$f":"AH14+AM14","v":0},0,0,"* 1 owngoal "]
[null,null,null,null,null,null,null,null,null,null,null,null,"2014-01-16","De Cupmaten - Verschilboys B",0,0,1,4,7,-3,{"$f":"AA16+AF48","v":0},{"$f":"AB16+AG16","v":0},1,4,7,0,{"$f":"AG16+AL16","v":0},0,0,0]
[null,null,16,16,null,0,{"$f":"SUM(G4:G14)","v":65},{"$f":"IF(ISERROR(G17/D17),\"\",G17/D17)","v":4.0625},null,{"$f":"SUM(J4:J16)","v":3},{"$f":"SUM(K4:K16)","v":0},null,"2014-01-29","Rima Sportif B - De Cupmaten",1,0,0,8,3,5,{"$f":"AA17+AF49","v":0},0,0,0,0,1,0,0,8,3]
[null,null,null,null,null,null,null,null,null,null,null,null,"2014-02-05","Supraboys - De Cupmaten",0,0,1,5,6,-1,{"$f":"AA18+AF51","v":0},1,0,0,0,0,0,1,5,6]
[null,"Beker",null,null,null,null,null,null,null,null,null,null,"2014-03-03","Roosen - De Cupmaten   ",1,0,0,3,2,1,0,0,0,0,0,1,0,0,3,2]
[null,null,null,null,null,null,null,null,null,null,null,null,"2014-03-13","De Cupmaten - Boomerangs B",1,0,0,7,1,6,1,0,0,7,1,0,0,0,0,0]
[null,"Speler","Aanwezig","Matchen","Afvaller","Forfait","Doelpunten","Gem doelp.","% aandeel","Geel","Rood",null,"2014-03-19","Vijfde Wiel - De Cupmaten",0,0,1,3,5,-2,0,1,0,0,0,0,0,1,3,5]
[null,"De Decker Guy",3,2,null,null,null,{"$f":"IF(ISERROR(G22/D22),\"\",G22/D22)","v":0},{"$f":"IF(ISERROR($G22/$G$34),\"\",$G22/$G$34)","v":0},0,0,null,"2014-04-03","De Cupmaten - A.S. Fortuna",0,0,1,3,6,-3,0,0,1,3,6,0,0,0,0,0]
[null,"De Decker Koen",4,4,null,null,null,{"$f":"IF(ISERROR(G23/D23),\"\",G23/D23)","v":0},0,0,0,null,"2014-04-17","De Cupmaten - Youngsters",{"$f":"U23+Z23","v":0},{"$f":"V23+AA23","v":0},1,4,7,-3,0,0,1,4,7,0,0,0,0,0]
[null,"Van Gils Bart",4,3,1,null,2,0.66666666666666663,0.13333333333333333,1,0,null,"Totaal",null,{"$f":"SUM(O4:O23)","v":8},2,10,84,77,7,3,6,4,30,34,5,0,6,54,43]
[null,"Vajda Dierckx Davy",3,3,null,null,3,1,0.2,0,0]
[null,"De Decker Hans",4,3,1,null,null,0,0,0,0,null,null,"Gemiddelde",{"$f":"IF(ISERROR(O$24/($O$24+$P$24+$Q$24)),\"\",O$24/($O$24+$P$24+$Q$24))","v":0.4},0.1,0.5,4.2,3.85,0.35,{"$f":"IF(ISERROR(U$24/($U$24+$V$24+$W$24)),\"\",U$24/($U$24+$V$24+$W$24))","v":0.23076923076923078},{"$f":"IF(ISERROR(V$24/($U$24+$V$24+$W$24)),\"\",V$24/($U$24+$V$24+$W$24))","v":0.46153846153846156},{"$f":"IF(ISERROR(W$24/($U$24+$V$24+$W$24)),\"\",W$24/($U$24+$V$24+$W$24))","v":0.30769230769230771},{"$f":"IF(ISERROR(X$24/($U$24+$V$24+$W$24)),\"\",X$24/($U$24+$V$24+$W$24))","v":2.3076923076923075},{"$f":"IF(ISERROR(Y$24/($U$24+$V$24+$W$24)),\"\",Y$24/($U$24+$V$24+$W$24))","v":2.6153846153846154},{"$f":"IF(ISERROR(Z$24/($Z$24+$AA$24+$AB$24)),\"\",Z$24/($Z$24+$AA$24+$AB$24))","v":0.45454545454545453},{"$f":"IF(ISERROR(AA$24/($Z$24+$AA$24+$AB$24)),\"\",AA$24/($Z$24+$AA$24+$AB$24))","v":0},{"$f":"IF(ISERROR(AB$24/($Z$24+$AA$24+$AB$24)),\"\",AB$24/($Z$24+$AA$24+$AB$24))","v":0.54545454545454541},{"$f":"IF(ISERROR(AC$24/($Z$24+$AA$24+$AB$24)),\"\",AC$24/($Z$24+$AA$24+$AB$24))","v":4.9090909090909092},{"$f":"IF(ISERROR(AD$24/($Z$24+$AA$24+$AB$24)),\"\",AD$24/($Z$24+$AA$24+$AB$24))","v":3.9090909090909092}]
[null,"Daemen Jan",2,1,1,null,null,0,0,0,0]
[null,"Van Dijck Vincent",2,2,null,null,null,0,0,0,0]
[null,"Westhof Jan",4,4,null,null,3,0.75,0.2,0,0]
[null,"Dom Steven",4,4,null,null,5,1.25,0.33333333333333331,1,0]
[null,"Bloemen Bart",1,1,1,null,null,0,0,0,0]
[null,"Daemen Geert-Jan",4,4,null,null,2,{"$f":"IF(ISERROR(G32/D32),\"\",G32/D32)","v":0.5},0.13333333333333333,0,0]
[]
[null,null,4,4,null,0,{"$f":"SUM(G22:G32)","v":15},{"$f":"IF(ISERROR(G34/D34),\"\",G34/D34)","v":3.75},null,{"$f":"SUM(J22:J33)","v":2},{"$f":"SUM(K22:K33)","v":0}]
[]
[null,"Totaal"]
[]
[null,"Speler","Aanwezig","Matchen","Afvaller","Forfait","Doelpunten","Gem doelp.","% aandeel","Geel","Rood"]
[{"$f":"$G39-$G39/100+(D39/100)-0.001","v":5.8999999999999997E-2},"De Decker Guy",{"$f":"C22+C4","v":11},6,0,0,0,{"$f":"IF(ISERROR(G39/D39),\"\",G39/D39)","v":0},{"$f":"IF(ISERROR($G39/$G$52),\"\",$G39/$G$52)","v":0},{"$f":"J4+J22","v":0},0]
[{"$f":"$G40-$G40/100+(D40/100)-0.02","v":1.1299999999999999},"De Decker Koen",17,16,1,0,1,{"$f":"IF(ISERROR(G40/D40),\"\",G40/D40)","v":6.25E-2},1.2500000000000001E-2,0,0]
[{"$f":"$G41-$G41/100+(D41/100)-0.11","v":9.9400000000000013},"Van Gils Bart",17,15,1,0,10,0.66666666666666663,0.125,1,0]
[{"$f":"$G42-$G42/100+(D42/100)-0.04","v":6.0100000000000007},"Vajda Dierckx Davy",13,11,1,0,6,0.54545454545454541,7.4999999999999997E-2,1,0]
[{"$f":"$G43-$G43/100+(D43/100)-0.09","v":8},"De Decker Hans",19,17,1,0,8,0.47058823529411764,0.1,0,0]
[{"$f":"$G44-$G44/100+(D44/100)-0.08","v":-9.999999999999995E-3},"Daemen Jan",14,7,3,0,0,0,0,0,0]
[{"$f":"$G45-$G45/100+(D45/100)-0.07","v":1.03},"Van Dijck Vincent",12,11,0,0,1,9.0909090909090912E-2,1.2500000000000001E-2,0,0]
[{"$f":"$G46-$G46/100+(D46/100)-0.0001","v":19.979900000000001},"Westhof Jan",19,18,1,0,20,1.1111111111111112,0.25,1,0]
[{"$f":"$G47-$G47/100+(D47/100)","v":24.95},"Dom Steven",20,20,0,0,25,1.25,0.3125,1,0]
[{"$f":"$G48-$G48/100+(D48/100)","v":1.07},"Bloemen Bart",8,8,1,0,1,0.125,1.2500000000000001E-2,{"$f":"J31+J13","v":1},{"$f":"K31+K13","v":0}]
[{"$f":"$G49-$G49/100+(D49/100)","v":8.08},"Daemen Geert-Jan",18,16,1,0,8,{"$f":"IF(ISERROR(G49/D49),\"\",G49/D49)","v":0.5},0.1,{"$f":"J14+J32","v":0},{"$f":"K14+K32","v":0}]
[{"$f":"$G50-$G50/100+(D50/100)","v":0.03},"Daemen Martijn",{"$f":"C15","v":3},{"$f":"D15","v":3},{"$f":"E15","v":0},{"$f":"F15","v":0},{"$f":"G15","v":0},{"$f":"IF(ISERROR(G50/D50),\"\",G50/D50)","v":0},0,{"$f":"J15","v":0},{"$f":"K15","v":0}]
[]
[null,null,{"$f":"C34+C17","v":20},{"$f":"D17+D34","v":20},null,{"$f":"F17+F34","v":0},{"$f":"SUM(G39:G50)","v":80},{"$f":"IF(ISERROR(G52/D52),\"\",G52/D52)","v":4},null,{"$f":"SUM(J39:J51)","v":5},{"$f":"SUM(K39:K51)","v":0}]
[]
[null,"Totaal",null,null,null,null,null,null,null,null,null,null,"Eindklassement"]
[]
[null,"Speler","Aanwezig","Matchen","Afvaller","Forfait","Doelpunten","Gem doelp.","% aandeel","Geel","Rood",null,null,"Ploeg","Winst","Gelijk","Verlies","Voor ","Tegen","DS","Punten"]
[{"$f":"LARGE($A$39:$A$50,ROW(A1))","v":24.95},{"$f":"VLOOKUP($A57,$A$39:$K$50,COLUMN(B1),FALSE)","v":"Dom Steven"},20,20,0,0,25,1.25,0.3125,1,0,null,1,"Verschilboys B",14,1,1,125,36,{"$f":"R57-S57","v":89},43]
[{"$f":"LARGE($A$39:$A$50,ROW(A2))","v":19.979900000000001},{"$f":"VLOOKUP($A58,$A$39:$K$50,COLUMN(B2),FALSE)","v":"Westhof Jan"},19,18,1,0,20,1.1111111111111112,0.25,1,0,null,2,"Youngsters",12,0,4,138,62,{"$f":"R58-S58","v":76},36]
[9.9400000000000013,{"$f":"VLOOKUP($A59,$A$39:$K$50,COLUMN(B3),FALSE)","v":"Van Gils Bart"},17,15,1,0,10,0.66666666666666663,0.125,1,0,null,3,"Supraboys",11,1,4,87,77,10,34]
[8.08,{"$f":"VLOOKUP($A60,$A$39:$K$50,COLUMN(B4),FALSE)","v":"Daemen Geert-Jan"},18,16,1,0,8,0.5,0.1,0,0,null,4,"Vijfde Wiel",9,1,6,89,68,21,28]
[8,{"$f":"VLOOKUP($A61,$A$39:$K$50,COLUMN(B5),FALSE)","v":"De Decker Hans"},19,17,1,0,8,0.47058823529411764,0.1,0,0,null,5,"De Cupmaten",7,1,8,68,63,5,22]
[6.0100000000000007,{"$f":"VLOOKUP($A62,$A$39:$K$50,COLUMN(B6),FALSE)","v":"Vajda Dierckx Davy"},13,11,1,0,6,0.54545454545454541,7.4999999999999997E-2,1,0,null,6,"Rima Sportif B",6,1,9,55,68,-13,19]
[1.1299999999999999,{"$f":"VLOOKUP($A63,$A$39:$K$50,COLUMN(B7),FALSE)","v":"De Decker Koen"},17,16,1,0,1,6.25E-2,1.2500000000000001E-2,0,0,null,7,"A.S. Fortuna",5,1,10,81,106,-25,16]
[1.07,{"$f":"VLOOKUP($A64,$A$39:$K$50,COLUMN(B8),FALSE)","v":"Bloemen Bart"},8,8,1,0,1,0.125,1.2500000000000001E-2,1,0,null,8,"Roosen",3,0,13,53,112,-59,9]
[1.03,{"$f":"VLOOKUP($A65,$A$39:$K$50,COLUMN(B9),FALSE)","v":"Van Dijck Vincent"},12,11,0,0,1,9.0909090909090912E-2,1.2500000000000001E-2,0,0,null,9,"Boomerangs B",2,0,14,36,140,-104,6]
[5.8999999999999997E-2,{"$f":"VLOOKUP($A66,$A$39:$K$50,COLUMN(B10),FALSE)","v":"De Decker Guy"},11,6,0,0,0,0,0,0,0]
[0.03,{"$f":"VLOOKUP($A67,$A$39:$K$50,COLUMN(B11),FALSE)","v":"Daemen Martijn"},3,3,0,0,0,0,0,0,0]
[-9.999999999999995E-3,{"$f":"VLOOKUP($A68,$A$39:$K$50,COLUMN(B12),FALSE)","v":"Daemen Jan"},14,7,3,0,0,0,0,0,0]
[]
[null,null,{"$f":"C52","v":20},{"$f":"D52","v":20},null,{"$f":"F52","v":0},{"$f":"G52","v":80},{"$f":"IF(ISERROR(G70/D70),\"\",G70/D70)","v":4},null,{"$f":"J52","v":5},{"$f":"K52","v":0}]

{"sheet":"Seizoen 2014-2015","index":5,"n_rows":69,"n_cols":31,"rows_kept":69,"cut":false,"hidden":false,"merged":[[1,20,1,24],[1,25,1,29]]}
[null,"Competitie",null,null,null,null,null,null,null,null,null,null,"Wedstrijden"]
[null,null,null,null,null,null,null,null,null,null,null,null,null,null,null,null,null,null,null,null,"Thuis",null,null,null,null,"Uit"]
[null,"Speler","Aanwezig","Matchen","Afvaller","Forfait","Doelpunten","Gem doelp.","% aandeel","Geel","Rood",null,"Datum","Wedstrijd","Winst","Gelijk","Verlies","Voor ","Tegen","DS","Winst","Gelijk","Verlies","Voor ","Tegen","Winst","Gelijk","Verlies","Voor ","Tegen"]
[null,"De Decker Guy",7,4,null,null,0,{"$f":"IF(ISERROR(G4/D4),\"\",G4/D4)","v":0},{"$f":"IF(ISERROR($G4/$G$17),\"\",$G4/$G$17)","v":0},0,0,null,"2014-09-11","De Cupmaten - Roosen",{"$f":"U4+Z4","v":1},0,{"$f":"$W4+$AB4","v":0},{"$f":"$X4+$AC4","v":2},{"$f":"$Y4+$AD4","v":0},{"$f":"$R4-$S4","v":2},1,0,0,2,0,0,0,0,0,0]
[null,"De Decker Koen",11,10,null,null,4,{"$f":"IF(ISERROR(G5/D5),\"\",G5/D5)","v":0.4},0.1,0,0,null,"2014-09-15","White Socks A - De Cupmaten",{"$f":"U5+Z5","v":0},{"$f":"V5+AA5","v":0},1,4,10,-6,{"$f":"AA5+AF38","v":0},0,0,0,0,0,{"$f":"AG5+AL5","v":0},1,4,10]
[null,"Van Gils Bart",7,4,null,null,2,{"$f":"IF(ISERROR(G6/D6),\"\",G6/D6)","v":0.5},0.05,1,0,null,"2014-09-29","Wöbbe B - De Cupmaten",1,0,0,3,1,2,0,0,0,0,0,1,0,0,3,1]
[null,"Vajda Dierckx Davy",6,6,null,null,2,{"$f":"IF(ISERROR(G7/D7),\"\",G7/D7)","v":0.33333333333333331},0.05,0,0,null,"2014-10-06","De Bergen A - De Cupmaten (BK)",0,0,1,0,8,-8,{"$f":"AA7+AF40","v":0},0,0,0,0,0,{"$f":"AG7+AL7","v":0},1,0,8]
[null,"De Decker Hans",11,11,null,null,7,0.63636363636363635,0.17499999999999999,0,0,null,"2014-10-13","FC Beton - De Cupmaten",1,0,0,4,0,4,0,0,0,0,0,1,0,0,4,0,"* own goal"]
[null,"Daemen Jan",3,0,null,null,0,"",0,0,0,null,"2014-10-23","De Cupmaten - De Bergen DS",0,0,1,4,6,-2,{"$f":"AA9+AF42","v":0},0,1,4,6,0,{"$f":"AG9+AL9","v":0},{"$f":"AH9+AM9","v":0},0,0]
[null,"Van Dijck Vincent",7,6,null,null,3,0.5,7.4999999999999997E-2,0,0,null,"2014-11-06","De Cupmaten - Dubos Verzekeringen",1,0,0,5,3,2,1,0,0,5,3,0,0,0,0,0]
[null,"Westhof Jan",9,9,null,null,8,0.88888888888888884,0.2,1,0,null,"2014-11-12","Boomerangs B - De Cupmaten",1,0,0,4,2,2,{"$f":"AA11+AF44","v":0},0,0,0,0,1,{"$f":"AG11+AL11","v":0},{"$f":"AH11+AM11","v":0},4,2]
[null,"Dom Steven",11,11,null,null,12,{"$f":"IF(ISERROR(G12/D12),\"\",G12/D12)","v":1.0909090909090908},0.3,1,0,null,"2014-11-17","A.S. Fortuna - De Cupmaten",1,0,0,4,0,4,0,0,0,0,0,1,0,0,4,0]
[null,"Daemen Geert-Jan",4,4,null,null,2,{"$f":"IF(ISERROR(G13/D13),\"\",G13/D13)","v":0.5},{"$f":"IF(ISERROR($G13/$G$17),\"\",$G13/$G$17)","v":0.05},0,0,null,"2014-11-27","De Cupmaten - Unlimited B",0,1,0,4,4,0,{"$f":"AA13+AF46","v":0},1,0,4,4,0,{"$f":"AG13+AL13","v":0},{"$f":"AH13+AM13","v":0},0,0]
[null,"Daemen Martijn",7,7,null,null,0,{"$f":"IF(ISERROR(G14/D14),\"\",G14/D14)","v":0},{"$f":"IF(ISERROR($G14/$G$17),\"\",$G14/$G$17)","v":0},0,0,null,"2014-12-03","De Sjepap - De Cupmaten",1,0,0,5,2,3,0,0,0,0,0,1,0,0,5,2]
[null,null,null,null,null,null,null,null,null,null,null,null,"2014-12-11","De Cupmaten - Fettah B",0,0,1,2,12,-10,{"$f":"AA15+AF48","v":0},0,1,2,12,0,{"$f":"AG15+AL15","v":0},{"$f":"AH15+AM15","v":0},0,0]
[null,null,null,null,null,null,null,null,null,null,null,null,"2015-01-08","Spinpedes B - De Cupmaten (BK)",0,0,0,0,0,0,0,0,0,0,0,0,0,0,0,0]
[null,null,11,11,null,0,{"$f":"SUM(G4:G13)","v":40},{"$f":"IF(ISERROR(G17/D17),\"\",G17/D17)","v":3.6363636363636362},null,{"$f":"SUM(J4:J16)","v":3},{"$f":"SUM(K4:K16)","v":0},null,"2015-01-14","Dubos Verzekeringen - De Cupmaten",0,0,0,0,0,0,{"$f":"AA17+AF49","v":0},0,0,0,0,0,{"$f":"AG17+AL17","v":0},{"$f":"AH17+AM17","v":0},0,0]
[null,null,null,null,null,null,null,null,null,null,null,null,"2015-01-22","De Cupmaten - De Sjepap",0,0,0,0,0,0,0,0,0,0,0,0,0,0,0,0]
[null,"Beker",null,null,null,null,null,null,null,null,null,null,"2015-01-30","Fettah B - De Cupmaten",0,0,0,0,0,0,{"$f":"AA19+AF51","v":0},0,0,0,0,0,{"$f":"AG19+AL19","v":0},{"$f":"AH19+AM19","v":0},0,0]
[null,null,null,null,null,null,null,null,null,null,null,null,"2015-02-06","Roosen - De Cupmaten",0,0,0,0,0,0,0,0,0,0,0,0,0,0,0,0]
[null,"Speler","Aanwezig","Matchen","Afvaller","Forfait","Doelpunten","Gem doelp.","% aandeel","Geel","Rood",null,"2015-02-12","De Cupmaten - Wöbbe B",0,0,0,0,0,0,{"$f":"AA21+AF53","v":0},0,0,0,0,0,{"$f":"AG21+AL21","v":0},{"$f":"AH21+AM21","v":0},0,0]
[null,"De Decker Guy",1,1,null,null,0,{"$f":"IF(ISERROR(G22/D22),\"\",G22/D22)","v":0},{"$f":"IF(ISERROR($G22/$G$35),\"\",$G22/$G$35)","v":""},0,0,null,"2015-02-19","De Cupmaten - A.S. Fortuna",0,0,0,0,0,0,0,0,0,0,0,0,0,0,0,0]
[null,"De Decker Koen",1,1,null,null,0,{"$f":"IF(ISERROR(G23/D23),\"\",G23/D23)","v":0},"",0,0,null,"2015-02-27","De Bergen DS - De Cupmaten",0,0,0,0,0,0,{"$f":"AA23+AF55","v":0},0,0,0,0,0,{"$f":"AG23+AL23","v":0},{"$f":"AH23+AM23","v":0},0,0]
[null,"Van Gils Bart",null,null,null,null,null,{"$f":"IF(ISERROR(G24/D24),\"\",G24/D24)","v":""},"",0,0,null,"2015-03-05","De Cupmaten - FC Beton",0,0,0,0,0,0,0,0,0,0,0,0,0,0,0,0]
[null,"Vajda Dierckx Davy",1,1,null,null,0,0,"",0,0,null,"2015-03-19","De Cupmaten - Boomerangs B",0,0,0,0,0,0,{"$f":"AA25+AF57","v":0},0,0,0,0,0,{"$f":"AG25+AL25","v":0},{"$f":"AH25+AM25","v":0},0,0]
[null,"De Decker Hans",1,1,null,null,0,0,"",0,0,null,"2015-03-27","Unlimited B - De Cupmaten",0,0,0,0,0,0,0,0,0,0,0,0,0,0,0,0]
[null,"Daemen Jan",1,0,null,null,0,"","",0,0,null,"2015-04-09","De Cupmaten - White Socks A",0,0,0,0,0,0,{"$f":"AA27+AF59","v":0},0,0,0,0,0,{"$f":"AG27+AL27","v":0},{"$f":"AH27+AM27","v":0},0,0]
[null,"Van Dijck Vincent",1,1,null,null,0,0,"",0,0,null,"Totaal",null,{"$f":"SUM(O4:O23)","v":7},1,4,41,48,-7,2,1,2,17,25,5,0,2,24,23]
[null,"Westhof Jan",1,1,null,null,0,0,"",0,0]
[null,"Dom Steven",1,1,null,null,0,0,"",0,0,null,null,"Gemiddelde",{"$f":"IF(ISERROR(O$28/($O$28+$P$28+$Q$28)),\"\",O$28/($O$28+$P$28+$Q$28))","v":0.58333333333333337},8.3333333333333329E-2,0.33333333333333331,3.4166666666666665,4,-0.58333333333333337,{"$f":"IF(ISERROR(U$28/($U$28+$V$28+$W$28)),\"\",U$28/($U$28+$V$28+$W$28))","v":0.4},{"$f":"IF(ISERROR(V$28/($U$28+$V$28+$W$28)),\"\",V$28/($U$28+$V$28+$W$28))","v":0.2},{"$f":"IF(ISERROR(W$28/($U$28+$V$28+$W$28)),\"\",W$28/($U$28+$V$28+$W$28))","v":0.4},{"$f":"IF(ISERROR(X$28/($U$28+$V$28+$W$28)),\"\",X$28/($U$28+$V$28+$W$28))","v":3.4},{"$f":"IF(ISERROR(Y$28/($U$28+$V$28+$W$28)),\"\",Y$28/($U$28+$V$28+$W$28))","v":5},{"$f":"IF(ISERROR(Z$28/($Z$28+$AA$28+$AB$28)),\"\",Z$28/($Z$28+$AA$28+$AB$28))","v":0.7142857142857143},{"$f":"IF(ISERROR(AA$28/($Z$28+$AA$28+$AB$28)),\"\",AA$28/($Z$28+$AA$28+$AB$28))","v":0},{"$f":"IF(ISERROR(AB$28/($Z$28+$AA$28+$AB$28)),\"\",AB$28/($Z$28+$AA$28+$AB$28))","v":0.2857142857142857},{"$f":"IF(ISERROR(AC$28/($Z$28+$AA$28+$AB$28)),\"\",AC$28/($Z$28+$AA$28+$AB$28))","v":3.4285714285714284},{"$f":"IF(ISERROR(AD$28/($Z$28+$AA$28+$AB$28)),\"\",AD$28/($Z$28+$AA$28+$AB$28))","v":3.2857142857142856}]
[null,"Daemen Geert-Jan",1,1,null,null,0,0,"",0,0]
[null,"Daemen Martijn",null,null,null,null,null,"","",0,0]
[]
[]
[null,null,1,1,null,0,{"$f":"SUM(G22:G34)","v":0},{"$f":"IF(ISERROR(G35/D35),\"\",G35/D35)","v":0},null,{"$f":"SUM(J22:J34)","v":0},{"$f":"SUM(K22:K34)","v":0}]
[]
[null,"Totaal"]
[]
[null,"Speler","Aanwezig","Matchen","Afvaller","Forfait","Doelpunten","Gem doelp.","% aandeel","Geel","Rood"]
[{"$f":"$G40-$G40/100+(D40/100)-0.001","v":4.9000000000000002E-2},"De Decker Guy",{"$f":"C22+C4","v":8},5,0,0,0,{"$f":"IF(ISERROR(G40/D40),\"\",G40/D40)","v":0},{"$f":"IF(ISERROR($G40/$G$52),\"\",$G40/$G$52)","v":0},{"$f":"J4+J22","v":0},0]
[{"$f":"$G41-$G41/100+(D41/100)-0.02","v":4.0500000000000007},"De Decker Koen",12,11,0,0,4,{"$f":"IF(ISERROR(G41/D41),\"\",G41/D41)","v":0.36363636363636365},0.1,0,0]
[{"$f":"$G42-$G42/100+(D42/100)-0.11","v":1.91},"Van Gils Bart",7,4,0,0,2,{"$f":"IF(ISERROR(G42/D42),\"\",G42/D42)","v":0.5},0.05,1,0]
[{"$f":"$G43-$G43/100+(D43/100)-0.04","v":2.0099999999999998},"Vajda Dierckx Davy",7,7,0,0,2,0.2857142857142857,0.05,0,0]
[{"$f":"$G44-$G44/100+(D44/100)-0.09","v":6.96},"De Decker Hans",12,12,0,0,7,0.58333333333333337,0.17499999999999999,0,0]
[{"$f":"$G45-$G45/100+(D45/100)-0.08","v":-0.08},"Daemen Jan",4,0,0,0,0,"",0,0,0]
[{"$f":"$G46-$G46/100+(D46/100)-0.07","v":2.97},"Van Dijck Vincent",8,7,0,0,3,0.42857142857142855,7.4999999999999997E-2,0,0]
[{"$f":"$G47-$G47/100+(D47/100)-0.0001","v":8.0198999999999998},"Westhof Jan",10,10,0,0,8,0.8,0.2,1,0]
[{"$f":"$G48-$G48/100+(D48/100)","v":12},"Dom Steven",12,12,0,0,12,1,0.3,1,0]
[{"$f":"$G49-$G49/100+(D49/100)","v":2.0299999999999998},"Daemen Geert-Jan",5,5,0,0,2,{"$f":"IF(ISERROR(G49/D49),\"\",G49/D49)","v":0.4},0.05,0,0]
[{"$f":"$G50-$G50/100+(D50/100)","v":7.0000000000000007E-2},"Daemen Martijn",{"$f":"C14+C32","v":7},{"$f":"D14+D32","v":7},{"$f":"E14+E32","v":0},{"$f":"F14+F32","v":0},{"$f":"G14+G32","v":0},{"$f":"IF(ISERROR(G50/D50),\"\",G50/D50)","v":0},0,0,0]
[]
[null,null,{"$f":"C35+C17","v":12},{"$f":"D17+D35","v":12},null,{"$f":"F17+F35","v":0},{"$f":"SUM(G40:G50)","v":40},{"$f":"IF(ISERROR(G52/D52),\"\",G52/D52)","v":3.3333333333333335},null,{"$f":"SUM(J40:J51)","v":3},{"$f":"SUM(K40:K51)","v":0}]
[]
[null,"Totaal"]
[]
[null,"Speler","Aanwezig","Matchen","Afvaller","Forfait","Doelpunten","Gem doelp.","% aandeel","Geel","Rood"]
[{"$f":"LARGE($A$40:$A$50,ROW(A1))","v":12},{"$f":"VLOOKUP($A57,$A$40:$K$50,COLUMN(B1),FALSE)","v":"Dom Steven"},12,12,0,0,12,1,0.3,1,0]
[8.0198999999999998,{"$f":"VLOOKUP($A58,$A$40:$K$50,COLUMN(B2),FALSE)","v":"Westhof Jan"},10,10,0,0,8,0.8,0.2,1,0]
[6.96,{"$f":"VLOOKUP($A59,$A$40:$K$50,COLUMN(B3),FALSE)","v":"De Decker Hans"},12,12,0,0,7,0.58333333333333337,0.17499999999999999,0,0]
[4.0500000000000007,{"$f":"VLOOKUP($A60,$A$40:$K$50,COLUMN(B4),FALSE)","v":"De Decker Koen"},12,11,0,0,4,0.36363636363636365,0.1,0,0]
[2.97,{"$f":"VLOOKUP($A61,$A$40:$K$50,COLUMN(B5),FALSE)","v":"Van Dijck Vincent"},8,7,0,0,3,0.42857142857142855,7.4999999999999997E-2,0,0]
[2.0299999999999998,{"$f":"VLOOKUP($A62,$A$40:$K$50,COLUMN(B6),FALSE)","v":"Daemen Geert-Jan"},5,5,0,0,2,0.4,0.05,0,0]
[2.0099999999999998,{"$f":"VLOOKUP($A63,$A$40:$K$50,COLUMN(B7),FALSE)","v":"Vajda Dierckx Davy"},7,7,0,0,2,0.2857142857142857,0.05,0,0]
[1.91,{"$f":"VLOOKUP($A64,$A$40:$K$50,COLUMN(B8),FALSE)","v":"Van Gils Bart"},7,4,0,0,2,0.5,0.05,1,0]
[7.0000000000000007E-2,{"$f":"VLOOKUP($A65,$A$40:$K$50,COLUMN(B9),FALSE)","v":"Daemen Martijn"},7,7,0,0,0,0,0,0,0]
[4.9000000000000002E-2,{"$f":"VLOOKUP($A66,$A$40:$K$50,COLUMN(B10),FALSE)","v":"De Decker Guy"},8,5,0,0,0,0,0,0,0]
[-0.08,{"$f":"VLOOKUP($A67,$A$40:$K$50,COLUMN(B11),FALSE)","v":"Daemen Jan"},4,0,0,0,0,"",0,0,0]
[]
[null,null,{"$f":"C52","v":12},{"$f":"D52","v":12},null,{"$f":"F52","v":0},{"$f":"G52","v":40},{"$f":"IF(ISERROR(G69/D69),\"\",G69/D69)","v":3.3333333333333335},null,{"$f":"J52","v":3},{"$f":"K52","v":0}]

{"sheet":"Totaal","index":6,"n_rows":232,"n_cols":20,"rows_kept":232,"cut":false,"hidden":false,"merged":[]}
[]
[]
[null,null,"Algemeen totaal"]
[]
[null,null,"Speler","Doelpunten","Matchen","Gem doelp.","% aandeel","Geel","Rood","Aanwez.","Afvaller"]
[{"$f":"$D6-$D6/100+(E6/100)","v":0.65},{"$f":"J6-J6/100-(D6/E6)","v":76.23},"De Decker Guy",{"$f":"+'Seizoen 2009-2010'!G36+'Seizoen 2010-2011'!G36+'Seizoen 2011-2012'!G38+'Seizoen 2012-2013 '!G42+'Seizoen 2013-2014  '!G39+'Seizoen 2014-2015'!G40","v":0},{"$f":"'Seizoen 2009-2010'!D36+'Seizoen 2010-2011'!D36+'Seizoen 2011-2012'!D38+'Seizoen 2012-2013 '!D42+'Seizoen 2013-2014  '!D39+'Seizoen 2014-2015'!D40","v":65},{"$f":"D6/E6","v":0},{"$f":"$D6/$E$23","v":0},{"$f":"'Seizoen 2009-2010'!J36+'Seizoen 2010-2011'!J36+'Seizoen 2011-2012'!J38+'Seizoen 2012-2013 '!J42+'Seizoen 2013-2014  '!J39+'Seizoen 2014-2015'!J40","v":0},{"$f":"'Seizoen 2009-2010'!K36+'Seizoen 2010-2011'!K36+'Seizoen 2011-2012'!K38+'Seizoen 2012-2013 '!K42+'Seizoen 2013-2014  '!K39+'Seizoen 2014-2015'!K40","v":0},{"$f":"'Seizoen 2009-2010'!C60+'Seizoen 2010-2011'!C63+'Seizoen 2011-2012'!C38+'Seizoen 2012-2013 '!C42+'Seizoen 2013-2014  '!C39+'Seizoen 2014-2015'!C40","v":77},{"$f":"'Seizoen 2010-2011'!E63+'Seizoen 2011-2012'!E64+'Seizoen 2013-2014  '!E39+'Seizoen 2014-2015'!E22+'Seizoen 2014-2015'!E40","v":2}]
[{"$f":"$D7-$D7/100","v":1.98},{"$f":"J7-J7/100-(D7/E7)","v":36.574444444444445},"Lenaerts Jaan",{"$f":"'Seizoen 2009-2010'!G37+'Seizoen 2010-2011'!G37+'Seizoen 2011-2012'!G39+'Seizoen 2012-2013 '!G43","v":2},{"$f":"'Seizoen 2009-2010'!D37+'Seizoen 2010-2011'!D37+'Seizoen 2011-2012'!D39+'Seizoen 2012-2013 '!C43","v":36},{"$f":"D7/E7","v":5.5555555555555552E-2},4.1493775933609959E-3,{"$f":"'Seizoen 2009-2010'!J37+'Seizoen 2010-2011'!J37+'Seizoen 2011-2012'!J39+'Seizoen 2012-2013 '!J43","v":2},{"$f":"'Seizoen 2009-2010'!K37+'Seizoen 2010-2011'!K37+'Seizoen 2011-2012'!K39+'Seizoen 2012-2013 '!K43","v":1},{"$f":"'Seizoen 2009-2010'!C61+'Seizoen 2010-2011'!C62+'Seizoen 2011-2012'!C39+'Seizoen 2012-2013 '!C43","v":37}]
[19.8,{"$f":"J8-J8/100-(E8/D8)","v":89.55},"De Decker Koen",{"$f":"'Seizoen 2009-2010'!G38+'Seizoen 2010-2011'!G38+'Seizoen 2011-2012'!G40+'Seizoen 2012-2013 '!G44+'Seizoen 2013-2014  '!G40+'Seizoen 2014-2015'!G41","v":20},{"$f":"'Seizoen 2009-2010'!D38+'Seizoen 2010-2011'!D38+'Seizoen 2011-2012'!D40+'Seizoen 2012-2013 '!C44+'Seizoen 2013-2014  '!D40+'Seizoen 2014-2015'!D41","v":90},0.22222222222222221,4.1493775933609957E-2,{"$f":"'Seizoen 2009-2010'!J38+'Seizoen 2010-2011'!J38+'Seizoen 2011-2012'!J39+'Seizoen 2011-2012'!J40+'Seizoen 2012-2013 '!J44+'Seizoen 2013-2014  '!J40+'Seizoen 2014-2015'!J41","v":1},{"$f":"'Seizoen 2009-2010'!K38+'Seizoen 2010-2011'!K38+'Seizoen 2011-2012'!K40+'Seizoen 2012-2013 '!K44+'Seizoen 2013-2014  '!K40+'Seizoen 2014-2015'!K41","v":0},{"$f":"'Seizoen 2009-2010'!C57+'Seizoen 2010-2011'!C59+'Seizoen 2011-2012'!C40+'Seizoen 2012-2013 '!C44+'Seizoen 2013-2014  '!C40+'Seizoen 2014-2015'!C41","v":95},{"$f":"'Seizoen 2011-2012'!E62+'Seizoen 2012-2013 '!E68+'Seizoen 2013-2014  '!E40+'Seizoen 2014-2015'!E41","v":3}]
[72.27,{"$f":"J9-J9/100-(E9/D9)","v":87.963013698630135},"Van Gils Bart",{"$f":"'Seizoen 2009-2010'!G39+'Seizoen 2010-2011'!G39+'Seizoen 2011-2012'!G41+'Seizoen 2012-2013 '!G45+'Seizoen 2013-2014  '!G41+'Seizoen 2014-2015'!G42","v":73},{"$f":"'Seizoen 2009-2010'!D39+'Seizoen 2010-2011'!D39+'Seizoen 2011-2012'!D41+'Seizoen 2012-2013 '!D45+'Seizoen 2013-2014  '!D41+'Seizoen 2014-2015'!D42","v":83},0.87951807228915657,0.15145228215767634,{"$f":"'Seizoen 2009-2010'!J39+'Seizoen 2010-2011'!J39+'Seizoen 2011-2012'!J41+'Seizoen 2012-2013 '!J45+'Seizoen 2013-2014  '!J41+'Seizoen 2014-2015'!J42","v":8},{"$f":"'Seizoen 2009-2010'!K39+'Seizoen 2010-2011'!K39+'Seizoen 2011-2012'!K41+'Seizoen 2012-2013 '!K45+'Seizoen 2013-2014  '!K41+'Seizoen 2014-2015'!K42","v":2},{"$f":"'Seizoen 2009-2010'!C53+'Seizoen 2010-2011'!C56+'Seizoen 2011-2012'!C41+'Seizoen 2012-2013 '!C45+'Seizoen 2013-2014  '!C41+'Seizoen 2014-2015'!C42","v":90},{"$f":"'Seizoen 2012-2013 '!E62+'Seizoen 2013-2014  '!E41+'Seizoen 2014-2015'!E42","v":2}]
[42.57,{"$f":"J10-J10/100-(E10/D10)","v":66.844883720930241},"Vajda Dierckx Davy",{"$f":"'Seizoen 2009-2010'!G40+'Seizoen 2010-2011'!G40+'Seizoen 2011-2012'!G42+'Seizoen 2012-2013 '!G46+'Seizoen 2013-2014  '!G42+'Seizoen 2014-2015'!G43","v":43},{"$f":"'Seizoen 2009-2010'!D40+'Seizoen 2010-2011'!D40+'Seizoen 2011-2012'!D42+'Seizoen 2012-2013 '!D46+'Seizoen 2013-2014  '!D42+'Seizoen 2014-2015'!D43","v":63},0.68253968253968256,8.9211618257261413E-2,{"$f":"'Seizoen 2009-2010'!J40+'Seizoen 2010-2011'!J40+'Seizoen 2011-2012'!J42+'Seizoen 2012-2013 '!J46+'Seizoen 2013-2014  '!J42+'Seizoen 2014-2015'!J43","v":1},{"$f":"'Seizoen 2009-2010'!K40+'Seizoen 2010-2011'!K40+'Seizoen 2011-2012'!K42+'Seizoen 2012-2013 '!K46+'Seizoen 2013-2014  '!K42+'Seizoen 2014-2015'!K43","v":0},{"$f":"'Seizoen 2009-2010'!C56+'Seizoen 2010-2011'!C57+'Seizoen 2011-2012'!C42+'Seizoen 2012-2013 '!C46+'Seizoen 2013-2014  '!C42+'Seizoen 2014-2015'!C43","v":69},{"$f":"'Seizoen 2011-2012'!E59+'Seizoen 2012-2013 '!E65+'Seizoen 2013-2014  '!E42+'Seizoen 2013-2014  '!E43+'Seizoen 2014-2015'!E43","v":4}]
[{"$f":"$D11-$D11/100+0.01","v":42.58},{"$f":"J11-J11/100-(E11/D11)","v":109.54441860465117},"De Decker Hans",{"$f":"+'Seizoen 2009-2010'!G41+'Seizoen 2010-2011'!G41+'Seizoen 2011-2012'!G43+'Seizoen 2012-2013 '!G47+'Seizoen 2013-2014  '!G43+'Seizoen 2014-2015'!G44","v":43},{"$f":"'Seizoen 2009-2010'!D41+'Seizoen 2010-2011'!D41+'Seizoen 2011-2012'!D43+'Seizoen 2012-2013 '!D47+'Seizoen 2013-2014  '!D43+'Seizoen 2014-2015'!D44","v":100},0.43,8.9211618257261413E-2,{"$f":"'Seizoen 2009-2010'!J41+'Seizoen 2010-2011'!J41+'Seizoen 2011-2012'!J43+'Seizoen 2012-2013 '!J47+'Seizoen 2013-2014  '!J43+'Seizoen 2014-2015'!J44","v":3},{"$f":"'Seizoen 2009-2010'!K41+'Seizoen 2010-2011'!K41+'Seizoen 2011-2012'!K43+'Seizoen 2012-2013 '!K47+'Seizoen 2013-2014  '!K43+'Seizoen 2014-2015'!K44","v":1},{"$f":"'Seizoen 2009-2010'!C54+'Seizoen 2010-2011'!C61+'Seizoen 2011-2012'!C43+'Seizoen 2012-2013 '!C47+'Seizoen 2013-2014  '!C43+'Seizoen 2014-2015'!C44","v":113},{"$f":"'Seizoen 2012-2013 '!E69+'Seizoen 2014-2015'!E44","v":1}]
[0.99,3.71,"Broeders Martijn",{"$f":"'Seizoen 2009-2010'!G42","v":1},{"$f":"'Seizoen 2009-2010'!D42","v":4},0.25,2.0746887966804979E-3,{"$f":"'Seizoen 2009-2010'!J42","v":0},{"$f":"'Seizoen 2009-2010'!K42","v":0},{"$f":"'Seizoen 2009-2010'!C59","v":4}]
[{"$f":"$D13-$D13/100","v":2.97},6.43,"Stymans Gert",{"$f":"'Seizoen 2010-2011'!G42","v":3},{"$f":"'Seizoen 2010-2011'!D42","v":6},0.5,6.2240663900414933E-3,{"$f":"'Seizoen 2010-2011'!J42","v":1},{"$f":"'Seizoen 2010-2011'!K42","v":0},{"$f":"'Seizoen 2010-2011'!C60","v":7}]
[21.78,{"$f":"J14-J14/100-(E14/D14)+1","v":86.281818181818181},"Van Dijck Vincent",{"$f":"'Seizoen 2009-2010'!G43+'Seizoen 2010-2011'!G43+'Seizoen 2011-2012'!G45+'Seizoen 2012-2013 '!G49+'Seizoen 2013-2014  '!G45+'Seizoen 2014-2015'!G46","v":22},{"$f":"'Seizoen 2009-2010'!D43+'Seizoen 2010-2011'!D43+'Seizoen 2011-2012'!D45+'Seizoen 2012-2013 '!D49+'Seizoen 2013-2014  '!D45+'Seizoen 2014-2015'!D46","v":84},0.26190476190476192,4.5643153526970952E-2,{"$f":"'Seizoen 2009-2010'!J43+'Seizoen 2010-2011'!J43+'Seizoen 2011-2012'!J45+'Seizoen 2012-2013 '!J49+'Seizoen 2013-2014  '!J45+'Seizoen 2014-2015'!J46","v":1},{"$f":"'Seizoen 2009-2010'!K43+'Seizoen 2010-2011'!K43+'Seizoen 2012-2013 '!K49+'Seizoen 2013-2014  '!K45+'Seizoen 2014-2015'!K46","v":0},{"$f":"'Seizoen 2009-2010'!C58+'Seizoen 2010-2011'!C58+'Seizoen 2012-2013 '!C49+'Seizoen 2011-2012'!C45+'Seizoen 2013-2014  '!C45+'Seizoen 2014-2015'!C46","v":90},{"$f":"'Seizoen 2009-2010'!E58+'Seizoen 2010-2011'!E58+'Seizoen 2011-2012'!E60+'Seizoen 2013-2014  '!E45+'Seizoen 2014-2015'!E46","v":3}]
[{"$f":"$D15-$D15/100+0.1","v":72.36999999999999},{"$f":"J15-J15/100-(E15/D15)","v":109.41424657534246},"Westhof Jan",{"$f":"'Seizoen 2009-2010'!G44+'Seizoen 2010-2011'!G44+'Seizoen 2011-2012'!G46+'Seizoen 2012-2013 '!G50+'Seizoen 2013-2014  '!G46+'Seizoen 2014-2015'!G47","v":73},{"$f":"'Seizoen 2009-2010'!D44+'Seizoen 2010-2011'!D44+'Seizoen 2011-2012'!D46+'Seizoen 2012-2013 '!D50+'Seizoen 2013-2014  '!D46+'Seizoen 2014-2015'!D47","v":107},0.68224299065420557,0.15145228215767634,{"$f":"'Seizoen 2009-2010'!J44+'Seizoen 2010-2011'!J44+'Seizoen 2011-2012'!J46+'Seizoen 2012-2013 '!J50+'Seizoen 2013-2014  '!J46+'Seizoen 2014-2015'!J47","v":3},{"$f":"'Seizoen 2009-2010'!K44+'Seizoen 2010-2011'!K44+'Seizoen 2011-2012'!K46+'Seizoen 2012-2013 '!K50+'Seizoen 2013-2014  '!K46+'Seizoen 2014-2015'!K47","v":0},{"$f":"'Seizoen 2009-2010'!C55+'Seizoen 2010-2011'!C55+'Seizoen 2011-2012'!C46+'Seizoen 2012-2013 '!C50+'Seizoen 2013-2014  '!C46+'Seizoen 2014-2015'!C47","v":112},{"$f":"'Seizoen 2009-2010'!E55+'Seizoen 2011-2012'!E57+'Seizoen 2013-2014  '!E46+'Seizoen 2014-2015'!E47","v":3}]
[{"$f":"$D16-$D16/100","v":152.46},{"$f":"J16-J16/100-(E16/D16)","v":113.13571428571429},"Dom Steven",{"$f":"'Seizoen 2009-2010'!G45+'Seizoen 2010-2011'!G45+'Seizoen 2011-2012'!G47+'Seizoen 2012-2013 '!G51+'Seizoen 2013-2014  '!G47+'Seizoen 2014-2015'!G48","v":154},{"$f":"'Seizoen 2009-2010'!D45+'Seizoen 2010-2011'!D45+'Seizoen 2011-2012'!D47+'Seizoen 2012-2013 '!D51+'Seizoen 2013-2014  '!D47+'Seizoen 2014-2015'!D48","v":110},1.4,0.31950207468879666,{"$f":"'Seizoen 2009-2010'!J45+'Seizoen 2010-2011'!J45+'Seizoen 2011-2012'!J47+'Seizoen 2012-2013 '!J51+'Seizoen 2013-2014  '!J47+'Seizoen 2014-2015'!J48","v":7},{"$f":"'Seizoen 2009-2010'!K45+'Seizoen 2010-2011'!K45+'Seizoen 2011-2012'!K47+'Seizoen 2012-2013 '!K51+'Seizoen 2013-2014  '!K47+'Seizoen 2014-2015'!K48","v":0},{"$f":"'Seizoen 2009-2010'!C52+'Seizoen 2010-2011'!C54+'Seizoen 2011-2012'!C47+H49+'Seizoen 2012-2013 '!C51+'Seizoen 2013-2014  '!C47+'Seizoen 2014-2015'!C48","v":115},{"$f":"'Seizoen 2009-2010'!E52+'Seizoen 2013-2014  '!E47+'Seizoen 2014-2015'!E48","v":1}]
[{"$f":"($D17-$D17/100)+0.1","v":1.0900000000000001},{"$f":"J17-J17/100","v":23.76},"Daemen Jan",{"$f":"'Seizoen 2011-2012'!G44+'Seizoen 2012-2013 '!G48+'Seizoen 2013-2014  '!G44+'Seizoen 2014-2015'!G45","v":1},{"$f":"'Seizoen 2011-2012'!D44+'Seizoen 2012-2013 '!D48+'Seizoen 2013-2014  '!D44+'Seizoen 2014-2015'!D45","v":23},4.3478260869565216E-2,2.0746887966804979E-3,{"$f":"'Seizoen 2011-2012'!J44+'Seizoen 2012-2013 '!J48+'Seizoen 2013-2014  '!J44+'Seizoen 2014-2015'!J45","v":0},{"$f":"'Seizoen 2011-2012'!K44+'Seizoen 2012-2013 '!K48+'Seizoen 2013-2014  '!K44+'Seizoen 2014-2015'!K45","v":0},{"$f":"'Seizoen 2011-2012'!C44+'Seizoen 2012-2013 '!C48+'Seizoen 2014-2015'!C45","v":24},{"$f":"'Seizoen 2012-2013 '!E72+'Seizoen 2013-2014  '!E44+'Seizoen 2014-2015'!E45","v":7}]
[{"$f":"($D18-$D18/100)+0.1","v":6.04},{"$f":"J18-J18/100-(E18/D18)","v":5.1066666666666674},"Burreddu Efisio",{"$f":"'Seizoen 2012-2013 '!G52","v":6},{"$f":"'Seizoen 2012-2013 '!D52","v":5},1.2,1.2448132780082987E-2,{"$f":"'Seizoen 2012-2013 '!J52","v":0},{"$f":"'Seizoen 2012-2013 '!K52","v":0},{"$f":"'Seizoen 2012-2013 '!C52","v":6}]
[{"$f":"($D19-$D19/100)+0.2","v":9.11},{"$f":"J19-J19/100-(E19/D19)","v":21.093333333333334},"Bloemen Bart",{"$f":"'Seizoen 2012-2013 '!G53+'Seizoen 2013-2014  '!G48","v":9},{"$f":"'Seizoen 2012-2013 '!D53+'Seizoen 2013-2014  '!D48","v":24},0.375,1.8672199170124481E-2,{"$f":"'Seizoen 2012-2013 '!J53+'Seizoen 2013-2014  '!J48","v":1},{"$f":"'Seizoen 2012-2013 '!K53+'Seizoen 2013-2014  '!K48","v":0},{"$f":"'Seizoen 2012-2013 '!C53+'Seizoen 2013-2014  '!C48","v":24},{"$f":"'Seizoen 2013-2014  '!E48","v":1}]
[{"$f":"$D20-$D20/100+E20/100","v":32.18},{"$f":"IF(ISERROR(J20-J20/100-(E20/D20)),\"\",J20-J20/100-(E20/D20))","v":52.887500000000003},"Daemen Geert-Jan",{"$f":"'Seizoen 2011-2012'!G48+'Seizoen 2012-2013 '!G54+'Seizoen 2013-2014  '!G49+'Seizoen 2014-2015'!G49","v":32},{"$f":"'Seizoen 2011-2012'!D48+'Seizoen 2012-2013 '!D54+'Seizoen 2013-2014  '!D49+'Seizoen 2014-2015'!D49","v":50},{"$f":"IF(ISERROR(D20/E20),\"\",D20/E20)","v":0.64},6.6390041493775934E-2,{"$f":"'Seizoen 2011-2012'!J48+'Seizoen 2012-2013 '!J54+'Seizoen 2013-2014  '!J49+'Seizoen 2014-2015'!J49","v":1},{"$f":"'Seizoen 2011-2012'!K48+'Seizoen 2012-2013 '!K54+'Seizoen 2013-2014  '!K49+'Seizoen 2014-2015'!K49","v":0},{"$f":"'Seizoen 2011-2012'!C48+'Seizoen 2012-2013 '!C54+'Seizoen 2013-2014  '!C49+'Seizoen 2014-2015'!C49","v":55},{"$f":"'Seizoen 2011-2012'!E58+'Seizoen 2013-2014  '!E49+'Seizoen 2014-2015'!E49","v":2}]
[{"$f":"$D21-$D21/100+E21/100","v":0.1},{"$f":"J21-J21/100","v":9.9},"Daemen Martijn",{"$f":"'Seizoen 2013-2014  '!G50+'Seizoen 2014-2015'!G50","v":0},{"$f":"'Seizoen 2013-2014  '!D50+'Seizoen 2014-2015'!D50","v":10},{"$f":"IF(ISERROR(D21/E21),\"\",D21/E21)","v":0},0,{"$f":"'Seizoen 2013-2014  '!J50+'Seizoen 2014-2015'!J50","v":0},{"$f":"'Seizoen 2013-2014  '!K50+'Seizoen 2014-2015'!K50","v":0},{"$f":"'Seizoen 2013-2014  '!D50+'Seizoen 2014-2015'!C50","v":10},{"$f":"'Seizoen 2013-2014  '!E50+'Seizoen 2014-2015'!E50","v":0}]
[]
[null,null,null,null,{"$f":"SUM(D6:D21)","v":482},null,null,{"$f":"SUM(H6:H22)","v":29},{"$f":"SUM(I6:I22)","v":4},{"$f":"'Seizoen 2009-2010'!C63+'Seizoen 2010-2011'!C65+'Seizoen 2011-2012'!C67+'Seizoen 2012-2013 '!C56+'Seizoen 2013-2014  '!C52+'Seizoen 2014-2015'!C52","v":120}]
[]
[]
[null,null,"Individueel totaal"]
[]
[null,null,"Speler","Doelpunten","Matchen","Gem doelp.","% aandeel","Geel","Rood"]
[{"$f":"LARGE($A$6:$A$21,ROW(A1))","v":152.46},null,{"$f":"VLOOKUP($A29,$A$6:$I$21,COLUMN(C1),FALSE)","v":"Dom Steven"},154,110,1.4,0.31950207468879666,7,0]
[{"$f":"LARGE($A$6:$A$21,ROW(A2))","v":72.36999999999999},null,{"$f":"VLOOKUP($A30,$A$6:$I$20,COLUMN(C2),FALSE)","v":"Westhof Jan"},73,107,0.68224299065420557,0.15145228215767634,3,0]
[72.27,null,{"$f":"VLOOKUP($A31,$A$6:$I$20,COLUMN(C3),FALSE)","v":"Van Gils Bart"},73,83,0.87951807228915657,0.15145228215767634,8,2]
[42.58,null,{"$f":"VLOOKUP($A32,$A$6:$I$20,COLUMN(C4),FALSE)","v":"De Decker Hans"},43,100,0.43,8.9211618257261413E-2,3,1]
[42.57,null,{"$f":"VLOOKUP($A33,$A$6:$I$20,COLUMN(C5),FALSE)","v":"Vajda Dierckx Davy"},43,63,0.68253968253968256,8.9211618257261413E-2,1,0]
[32.18,null,{"$f":"VLOOKUP($A34,$A$6:$I$20,COLUMN(C6),FALSE)","v":"Daemen Geert-Jan"},32,50,0.64,6.6390041493775934E-2,1,0]
[21.78,null,{"$f":"VLOOKUP($A35,$A$6:$I$20,COLUMN(C7),FALSE)","v":"Van Dijck Vincent"},22,84,0.26190476190476192,4.5643153526970952E-2,1,0]
[19.8,null,{"$f":"VLOOKUP($A36,$A$6:$I$20,COLUMN(C8),FALSE)","v":"De Decker Koen"},20,90,0.22222222222222221,4.1493775933609957E-2,1,0]
[9.11,null,{"$f":"VLOOKUP($A37,$A$6:$I$20,COLUMN(C9),FALSE)","v":"Bloemen Bart"},9,24,0.375,1.8672199170124481E-2,1,0]
[6.04,null,{"$f":"VLOOKUP($A38,$A$6:$I$20,COLUMN(C10),FALSE)","v":"Burreddu Efisio"},6,5,1.2,1.2448132780082987E-2,0,0]
[2.97,null,{"$f":"VLOOKUP($A39,$A$6:$I$20,COLUMN(C11),FALSE)","v":"Stymans Gert"},3,6,0.5,6.2240663900414933E-3,1,0]
[1.98,null,{"$f":"VLOOKUP($A40,$A$6:$I$20,COLUMN(C12),FALSE)","v":"Lenaerts Jaan"},2,36,5.5555555555555552E-2,4.1493775933609959E-3,2,1]
[1.0900000000000001,null,"Daemen Jan",1,23,4.3478260869565216E-2,2.0746887966804979E-3,0,0]
[0.99,null,"Broeders Martijn",1,4,0.25,2.0746887966804979E-3,0,0]
[0.65,null,"De Decker Guy",0,65,0,0,0,0]
[0.1,null,{"$f":"VLOOKUP($A44,$A$6:$I$21,COLUMN(C16),FALSE)","v":"Daemen Martijn"},0,10,0,0,0,0]
[]
[null,null,null,{"$f":"SUM(D29:D44)","v":482},{"$f":"'Seizoen 2009-2010'!D47+'Seizoen 2010-2011'!D47+'Seizoen 2011-2012'!D67+'Seizoen 2012-2013 '!D56+'Seizoen 2013-2014  '!D52+'Seizoen 2014-2015'!D52","v":118},{"$f":"D46/E46","v":4.0847457627118642},null,{"$f":"SUM(H29:H44)","v":29},{"$f":"SUM(I29:I44)","v":4}]
[]
[null,null,"Algemeen totaal"]
[]
[]
[null,null,null,null,null,null,null,null,null,null,"Thuis",null,null,null,null,"Uit"]
[null,null,null,"Wedstrijden","Winst","Gelijk","Verlies","Voor ","Tegen","DS","Winst","Gelijk","Verlies","Voor ","Tegen","Winst","Gelijk","Verlies","Voor ","Tegen"]
[null,null,"Seizoen 2009-2010",{"$f":"G53+F53+E53","v":23},{"$f":"'Seizoen 2009-2010'!O27","v":4},{"$f":"'Seizoen 2009-2010'!P27","v":2},{"$f":"'Seizoen 2009-2010'!Q27","v":17},{"$f":"'Seizoen 2009-2010'!R27","v":78},{"$f":"'Seizoen 2009-2010'!S27","v":152},{"$f":"'Seizoen 2009-2010'!T27","v":-74},{"$f":"'Seizoen 2009-2010'!U27","v":1},{"$f":"'Seizoen 2009-2010'!V27","v":1},{"$f":"'Seizoen 2009-2010'!W27","v":10},{"$f":"'Seizoen 2009-2010'!X27","v":30},{"$f":"'Seizoen 2009-2010'!Y27","v":73},{"$f":"'Seizoen 2009-2010'!Z27","v":3},{"$f":"'Seizoen 2009-2010'!AA27","v":1},{"$f":"'Seizoen 2009-2010'!AB27","v":7},{"$f":"'Seizoen 2009-2010'!AC27","v":48},{"$f":"'Seizoen 2009-2010'!AD27","v":79}]
[null,null,"Seizoen 2010-2011",{"$f":"G54+F54+E54","v":21},{"$f":"'Seizoen 2010-2011'!O25","v":6},{"$f":"'Seizoen 2010-2011'!P25","v":1},{"$f":"'Seizoen 2010-2011'!Q25","v":14},{"$f":"'Seizoen 2010-2011'!R25","v":92},{"$f":"'Seizoen 2010-2011'!S25","v":128},{"$f":"'Seizoen 2010-2011'!T25","v":-36},{"$f":"'Seizoen 2010-2011'!U25","v":5},{"$f":"'Seizoen 2010-2011'!V25","v":0},{"$f":"'Seizoen 2010-2011'!W25","v":6},{"$f":"'Seizoen 2010-2011'!X25","v":59},{"$f":"'Seizoen 2010-2011'!Y25","v":61},{"$f":"'Seizoen 2010-2011'!Z25","v":1},{"$f":"'Seizoen 2010-2011'!AA25","v":1},{"$f":"'Seizoen 2010-2011'!AB25","v":8},{"$f":"'Seizoen 2010-2011'!AC25","v":33},{"$f":"'Seizoen 2010-2011'!AD25","v":67}]
[null,null,"Seizoen 2011-2012",{"$f":"G55+F55+E55","v":26},{"$f":"'Seizoen 2011-2012'!O31","v":10},{"$f":"'Seizoen 2011-2012'!P31","v":2},{"$f":"'Seizoen 2011-2012'!Q31","v":14},{"$f":"'Seizoen 2011-2012'!R31","v":128},{"$f":"'Seizoen 2011-2012'!S31","v":149},{"$f":"'Seizoen 2011-2012'!T31","v":-21},{"$f":"'Seizoen 2011-2012'!U31","v":6},{"$f":"'Seizoen 2011-2012'!V31","v":0},{"$f":"'Seizoen 2011-2012'!W31","v":7},{"$f":"'Seizoen 2011-2012'!X31","v":67},{"$f":"'Seizoen 2011-2012'!Y31","v":70},{"$f":"'Seizoen 2011-2012'!Z31","v":4},{"$f":"'Seizoen 2011-2012'!AA31","v":2},{"$f":"'Seizoen 2011-2012'!AB31","v":7},{"$f":"'Seizoen 2011-2012'!AC31","v":61},{"$f":"'Seizoen 2011-2012'!AD31","v":79}]
[null,null,"Seizoen 2012-2013",{"$f":"E56+F56+G56","v":19},{"$f":"'Seizoen 2012-2013 '!O25","v":6},{"$f":"'Seizoen 2012-2013 '!P25","v":0},{"$f":"'Seizoen 2012-2013 '!Q25","v":13},{"$f":"'Seizoen 2012-2013 '!R25","v":85},{"$f":"'Seizoen 2012-2013 '!S25","v":107},{"$f":"'Seizoen 2012-2013 '!T25","v":-22},{"$f":"'Seizoen 2012-2013 '!U25","v":3},{"$f":"'Seizoen 2012-2013 '!V25","v":0},{"$f":"'Seizoen 2012-2013 '!W25","v":6},{"$f":"'Seizoen 2012-2013 '!X25","v":51},{"$f":"'Seizoen 2012-2013 '!Y25","v":45},{"$f":"'Seizoen 2012-2013 '!Z25","v":3},{"$f":"'Seizoen 2012-2013 '!AA25","v":0},{"$f":"'Seizoen 2012-2013 '!AB25","v":7},{"$f":"'Seizoen 2012-2013 '!AC25","v":34},{"$f":"'Seizoen 2012-2013 '!AD25","v":62}]
[null,null,"Seizoen 2013-2014",{"$f":"E57+F57+G57","v":20},{"$f":"'Seizoen 2013-2014  '!O24","v":8},{"$f":"'Seizoen 2013-2014  '!P24","v":2},{"$f":"'Seizoen 2013-2014  '!Q24","v":10},{"$f":"'Seizoen 2013-2014  '!R24","v":84},{"$f":"'Seizoen 2013-2014  '!S24","v":77},{"$f":"'Seizoen 2013-2014  '!T24","v":7},{"$f":"'Seizoen 2013-2014  '!U24","v":3},{"$f":"'Seizoen 2013-2014  '!V24","v":6},{"$f":"'Seizoen 2013-2014  '!W24","v":4},{"$f":"'Seizoen 2013-2014  '!X24","v":30},{"$f":"'Seizoen 2013-2014  '!Y24","v":34},{"$f":"'Seizoen 2013-2014  '!Z24","v":5},{"$f":"'Seizoen 2013-2014  '!AA24","v":0},{"$f":"'Seizoen 2013-2014  '!AB24","v":6},{"$f":"'Seizoen 2013-2014  '!AC24","v":54},{"$f":"'Seizoen 2013-2014  '!AD24","v":43}]
[null,null,"Seizoen 2014-2015",{"$f":"G58+F58+E58","v":12},{"$f":"'Seizoen 2014-2015'!O28","v":7},{"$f":"'Seizoen 2014-2015'!P28","v":1},{"$f":"'Seizoen 2014-2015'!Q28","v":4},{"$f":"'Seizoen 2014-2015'!R28","v":41},{"$f":"'Seizoen 2014-2015'!S28","v":48},{"$f":"'Seizoen 2014-2015'!T28","v":-7},{"$f":"'Seizoen 2014-2015'!U28","v":2},{"$f":"'Seizoen 2014-2015'!V28","v":1},{"$f":"'Seizoen 2014-2015'!W28","v":2},{"$f":"'Seizoen 2014-2015'!X28","v":17},{"$f":"'Seizoen 2014-2015'!Y28","v":25},{"$f":"'Seizoen 2014-2015'!Z28","v":5},{"$f":"'Seizoen 2014-2015'!AA28","v":0},{"$f":"'Seizoen 2014-2015'!AB28","v":2},{"$f":"'Seizoen 2014-2015'!AC28","v":24},{"$f":"'Seizoen 2014-2015'!AD28","v":23}]
[null,null,"Totaal",{"$f":"SUM(D53:D58)","v":121},41,8,72,508,661,-153,20,8,35,254,308,21,4,37,254,353]
[]
[null,null,null,"Gemiddelde",{"$f":"E$59/$D$59","v":0.33884297520661155},6.6115702479338845E-2,0.5950413223140496,4.1983471074380168,5.4628099173553721,-1.2644628099173554,{"$f":"K$59/($K$59+$L$59+$M$59)","v":0.31746031746031744},{"$f":"L$59/($K$59+$L$59+$M$59)","v":0.12698412698412698},{"$f":"M$59/($K$59+$L$59+$M$59)","v":0.55555555555555558},{"$f":"N$59/($K$59+$L$59+$M$59)","v":4.0317460317460316},{"$f":"O$59/($K$59+$L$59+$M$59)","v":4.8888888888888893},{"$f":"P$59/($P$59+$Q$59+$R$59)","v":0.33870967741935482},{"$f":"Q$59/($P$59+$Q$59+$R$59)","v":6.4516129032258063E-2},{"$f":"R$59/($P$59+$Q$59+$R$59)","v":0.59677419354838712},{"$f":"S$59/($P$59+$Q$59+$R$59)","v":4.096774193548387},{"$f":"T$59/($P$59+$Q$59+$R$59)","v":5.693548387096774}]
[]
[]
[null,null,"Mijlpalen"]
[]
[null,null,"Eerste Wedstrijd","17/09/2009 De Cupmaten - Spinpedes B 0-10 "]
[null,null,"Eerste Doelpunt","23/09/2009 De Waterput - De Cupmaten - 28' Jan Westhof "]
[null,null,"Eerste Gele kaart","17/09/2009 De Cupmaten - Spinpedes B - 36' Steven Dom"]
[null,null,"Eerste Rode Kaart","21/01/2010 Spinpedes B - De Cupmaten  - 45' Bart Van Gils"]
[null,null,"Eerste Own goal","16/11/2009 Ministerie - De Cupmaten  - 10' Jaan Lenaerts"]
[null,null,"Eerste Hattrick (echte)","18/02/2010 De Cupmaten - Wollewei  - Steven Dom"]
[null,null,"Eerste Nul gehouden","28/03/2013 De Cupmaten - De Bergen B - Jan Daemen"]
[null,null,"Grootste verlies","05/09/2012 HVP United - De Cupmaten 4-16"]
[null,null,"Grootste winst","15/11/2012 De Cupmaten – Boomerangs B 20-2"]
[]
[]
[null,null,"Doelpunt 50","3/03/2010 Desportivo - De Cupmaten  - 32' Hans De Decker"]
[null,null,"Doelpunt 100","25/10/2010 Turnhout 86 - De Cupmaten - 45' Steven Dom"]
[null,null,"Doelpunt 150","28/03/2011 KDS. Turnhout - De Cupmaten - 5' Steven Dom"]
[null,null,"Doelpunt 200","23/11/2011 De Bergen A - De Cupmaten - 43' Vincent Van Dijck"]
[null,null,"Doelpunt 250","23/02/2012 De Cupmaten - Biljart Palace - 26' Steven Dom"]
[null,null,"Doelpunt 300","15/11/2012 De Cupmaten – Boomerangs B - 20' Geert-Jan Daemen"]
[null,null,"Doelpunt 350","28/03/2013 De Cupmaten - De Bergen B - '12 Bart Bloemen"]
[null,null,"Doelpunt 400","28/11/2013 De Cupmaten - Lierseweg (BK) - '44 Davy Vajda Dierckx"]
[null,null,"Doelpunt 450","29/09/2014 Wöbbe B - De Cupmaten - '14 Geert-Jan Daemen"]
[]
[null,null,"Topscorers"]
[]
[null,null,null,"Seizoen 2009-2010"]
[null,null,1,{"$f":"'Seizoen 2009-2010'!B52","v":"Dom Steven"},{"$f":"'Seizoen 2009-2010'!G52","v":22}]
[null,null,2,{"$f":"'Seizoen 2009-2010'!B53","v":"Van Gils Bart"},{"$f":"'Seizoen 2009-2010'!G53","v":16}]
[null,null,3,{"$f":"'Seizoen 2009-2010'!B54","v":"De Decker Hans"},{"$f":"'Seizoen 2009-2010'!G54","v":15}]
[]
[null,null,null,"Seizoen 2010-2011"]
[null,null,1,{"$f":"'Seizoen 2010-2011'!B54","v":"Dom Steven"},{"$f":"'Seizoen 2010-2011'!G54","v":37}]
[null,null,2,{"$f":"'Seizoen 2010-2011'!B55","v":"Westhof Jan"},{"$f":"'Seizoen 2010-2011'!G55","v":10}]
[null,null,3,{"$f":"'Seizoen 2010-2011'!B56","v":"Van Gils Bart"},{"$f":"'Seizoen 2010-2011'!G56","v":10}]
[]
[null,null,null,"Seizoen 2011-2012"]
[null,null,1,{"$f":"'Seizoen 2011-2012'!B55","v":"Dom Steven"},{"$f":"'Seizoen 2011-2012'!G55","v":40}]
[null,null,2,{"$f":"'Seizoen 2011-2012'!B56","v":"Van Gils Bart"},{"$f":"'Seizoen 2011-2012'!G56","v":20}]
[null,null,3,{"$f":"'Seizoen 2011-2012'!B57","v":"Westhof Jan"},{"$f":"'Seizoen 2011-2012'!G57","v":12}]
[]
[null,null,null,"Seizoen 2012-2013"]
[null,null,1,{"$f":"'Seizoen 2012-2013 '!B61","v":"Dom Steven"},{"$f":"'Seizoen 2012-2013 '!G61","v":18}]
[null,null,2,{"$f":"'Seizoen 2012-2013 '!B62","v":"Van Gils Bart"},{"$f":"'Seizoen 2012-2013 '!G62","v":15}]
[null,null,3,{"$f":"'Seizoen 2012-2013 '!B63","v":"Westhof Jan"},{"$f":"'Seizoen 2012-2013 '!G63","v":11}]
[]
[null,null,null,"Seizoen 2013-2014"]
[null,null,1,{"$f":"'Seizoen 2013-2014  '!B57","v":"Dom Steven"},{"$f":"'Seizoen 2013-2014  '!G57","v":25}]
[null,null,2,{"$f":"'Seizoen 2013-2014  '!B58","v":"Westhof Jan"},{"$f":"'Seizoen 2013-2014  '!G58","v":20}]
[null,null,3,{"$f":"'Seizoen 2013-2014  '!B59","v":"Van Gils Bart"},{"$f":"'Seizoen 2013-2014  '!G59","v":10}]
[]
[null,null,null,"Seizoen 2014-2015"]
[null,null,1,{"$f":"'Seizoen 2014-2015'!B57","v":"Dom Steven"},{"$f":"'Seizoen 2014-2015'!G57","v":12}]
[null,null,2,{"$f":"'Seizoen 2014-2015'!B58","v":"Westhof Jan"},{"$f":"'Seizoen 2014-2015'!G58","v":8}]
[null,null,3,{"$f":"'Seizoen 2014-2015'!B59","v":"De Decker Hans"},{"$f":"'Seizoen 2014-2015'!G59","v":7}]
[]
[null,null,null,"All-time"]
[null,null,1,{"$f":"C29","v":"Dom Steven"},154]
[null,null,2,"Westhof Jan",73]
[null,null,3,"Van Gils Bart",73]
[]
[null,null,"Aanwezigheden"]
[]
[null,null,"Speler","Aanwezigheden","% Aanwezig","Matchen","% Matchen"]
[null,{"$f":"LARGE($B$6:$B$21,ROW(K1))","v":113.13571428571429},{"$f":"VLOOKUP($B127,$B$6:$J$21,COLUMN(B1),FALSE)","v":"Dom Steven"},{"$f":"VLOOKUP($B127,$B$6:$J$21,COLUMN(I1),FALSE)","v":115},{"$f":"$D127/$D$144","v":0.95833333333333337},{"$f":"VLOOKUP($B127,$B$6:$K$21,COLUMN(D1),FALSE)","v":110},{"$f":"$F127/$F$144","v":0.93220338983050843}]
[null,109.54441860465117,"De Decker Hans",113,{"$f":"$D128/$D$144","v":0.94166666666666665},100,{"$f":"$F128/$F$144","v":0.84745762711864403}]
[null,109.41424657534246,"Westhof Jan",112,0.93333333333333335,107,0.90677966101694918]
[null,89.55,"De Decker Koen",95,0.79166666666666663,90,0.76271186440677963]
[null,87.963013698630135,"Van Gils Bart",90,0.75,83,0.70338983050847459]
[null,86.281818181818181,"Van Dijck Vincent",90,0.75,84,0.71186440677966101]
[null,76.23,"De Decker Guy",77,0.64166666666666672,65,0.55084745762711862]
[null,66.844883720930241,"Vajda Dierckx Davy",69,0.57499999999999996,63,0.53389830508474578]
[null,52.887500000000003,"Daemen Geert-Jan",55,0.45833333333333331,50,0.42372881355932202]
[null,36.574444444444445,"Lenaerts Jaan",37,0.30833333333333335,36,0.30508474576271188]
[null,23.76,"Daemen Jan",24,0.2,23,0.19491525423728814]
[null,21.093333333333334,"Bloemen Bart",24,0.2,24,0.20338983050847459]
[null,9.9,"Daemen Martijn",10,8.3333333333333329E-2,10,8.4745762711864403E-2]
[null,6.43,"Stymans Gert",7,5.8333333333333334E-2,6,5.0847457627118647E-2]
[null,5.1066666666666674,"Burreddu Efisio",6,0.05,5,4.2372881355932202E-2]
[null,3.71,"Broeders Martijn",4,3.3333333333333333E-2,4,3.3898305084745763E-2]
[]
[null,null,null,{"$f":"J23","v":120},null,{"$f":"E46","v":118}]
[]
[null,null,"Tegenstanders gemaakte doelpunten"]
[]
[null,null,"Plaats","Tegenstander","Doelpunten","Wedstrijden","Gem.","For.","W","G","V"]
[null,null,1,"Boomerangs B",73,9,{"$f":"E149/F149","v":8.1111111111111107},1,7,0,2]
[null,null,2,"KDS. Turnhout",40,6,6.67,null,5,0,1]
[null,null,3,"Supraboys",26,7,{"$f":"E151/F151","v":3.7142857142857144},null,4,1,2]
[null,null,4,"De Bergen B",21,2,10.5,null,2,0,0]
[null,null,5,"Biljart Palace",18,2,9.5,null,2,0,0]
[null,null,6,"Turnhout 86",16,4,4,null,0,0,4]
[null,null,7,"P&V Turnhout",16,4,4,null,0,2,2]
[null,null,8,"De Waterput",15,4,3.75,null,0,0,4]
[null,null,9,"Boost",14,3,4,null,1,0,2]
[null,null,10,"Verschilboys B",13,4,{"$f":"E158/F158","v":3.25},null,1,0,3]
[null,null,11,"De Ster",11,2,5.5,null,0,0,2]
[null,null,12,"Rima Sportif B",11,2,{"$f":"E160/F160","v":5.5},null,1,1,0]
[null,null,13,"Vijde Wiel",10,4,2.5,1,0,1,3]
[null,null,14,"Roosen",10,3,{"$f":"E162/F162","v":3.3333333333333335},null,3,0,0]
[null,null,15,"Ministerie",9,4,2.25,null,0,0,4]
[null,null,16,"Barza",9,2,4.5,null,1,0,1]
[null,null,17,"Het Vervolg",8,2,4,null,0,0,2]
[null,null,18,"Hoek van Portugal",7,2,3.5,null,1,0,1]
[null,null,19,"Arendonk",7,2,3.5,null,0,0,2]
[null,null,20,"De Zwaluw",7,1,7,null,0,0,1]
[null,null,21,"De Kempen",7,1,7,null,1,0,0]
[null,null,22,"Wollewei",6,2,3,null,0,1,1]
[null,null,23,"Tugas",6,2,3,null,0,0,2]
[null,null,24,"AS Fortuna",9,2,6,null,2,0,0]
[null,null,25,"Dubos Verzekeringen",5,1,5,null,1,0,0]
[null,null,26,"Lierseweg",5,1,5,null,0,0,1]
[null,null,27,"Spinpedes B",5,2,2.5,null,1,0,1]
[null,null,28,"De Sjepap",10,3,{"$f":"E176/F176","v":3.3333333333333335},null,1,0,2]
[null,null,29,"The Young Ones",5,2,2.5,null,0,0,2]
[null,null,null,"Unlimited B",4,1,4,null,0,1,0]
[null,null,30,"White Socks A",4,1,4,null,0,0,1]
[null,null,31,"De Bergen DS",4,1,4,null,0,0,1]
[null,null,32,"De Bergen A",4,2,2,null,0,0,2]
[null,null,33,"HVP United",4,1,4,null,0,0,1]
[null,null,34,"FC Beton",3,1,3,null,1,0,0]
[null,null,35,"Wöbbe B",3,1,3,null,1,0,0]
[null,null,36,"Roma",3,1,3,null,0,0,1]
[null,null,37,"Youngsters",3,1,3,null,0,0,1]
[null,null,38,"Het Kafeeke",3,1,3,null,0,0,1]
[null,null,39,"Jumpaz United",3,2,1.5,null,0,0,2]
[null,null,40,"Montana",3,2,1.5,null,0,0,2]
[null,null,41,"Den Toren",3,1,3,null,0,0,1]
[null,null,42,"Desportivo",2,2,1,null,0,0,2]
[null,null,43,"Atlaslions A",2,1,2,null,0,0,1]
[null,null,44,"De Fuik",2,1,2,null,0,1,0]
[null,null,45,"Giel",1,1,1,null,0,0,1]
[null,null,46,"De Plekkers",1,1,1,null,0,0,1]
[null,null,47,"Atlético",1,1,1,null,0,0,1]
[null,null,48,"De Brouwerij",1,2,0.5,null,0,0,2]
[null,null,49,"Fettah",2,1,2,1,1,0,1]
[]
[]
[null,null,null,"Forfait",15,3]
[null,null,null,"Own goals",11]
[]
[]
[null,null,"Afvallers"]
[null,null,"Speler","% Aanwezig","Afvaller","Seizoen 13-14",null,null,null,null,null,null,null,null,"Speler","% Aanwezig","Afvaller","Seizoen 13-14"]
[null,null,{"$f":"C127","v":"Dom Steven"},{"$f":"$J$16/$J$23","v":0.95833333333333337},{"$f":"$K$16","v":1},{"$f":"'Seizoen 2013-2014  '!$E$47","v":0},null,null,null,null,null,null,null,null,"De Decker Guy",0.66326530612244894,2,0]
[null,null,{"$f":"C128","v":"De Decker Hans"},{"$f":"$J$15/$J$23","v":0.93333333333333335},{"$f":"$K$15","v":3},{"$f":"'Seizoen 2013-2014  '!$E$46","v":1},null,null,null,null,null,null,null,null,"Van Dijck Vincent",0.76530612244897955,2,0]
[null,null,"Westhof Jan",{"$f":"$J$11/$J$23","v":0.94166666666666665},{"$f":"$K$11","v":1},{"$f":"'Seizoen 2013-2014  '!$E$43","v":1},null,null,null,null,null,null,null,null,"Dom Steven",0.94897959183673475,1,0]
[null,null,"De Decker Koen",{"$f":"$J$14/$J$23","v":0.75},{"$f":"$K$14","v":3},{"$f":"'Seizoen 2013-2014  '!$E$41","v":1},null,null,null,null,null,null,null,null,"Vajda Dierckx Davy",0.69795918367346932,4,1]
[null,null,"Van Gils Bart",{"$f":"$J$9/$J$23","v":0.75},{"$f":"$K$9","v":2},{"$f":"'Seizoen 2013-2014  '!$E$45","v":0},null,null,null,null,null,null,null,null,"Daemen Geert-Jan",0.7321428571428571,2,1]
[null,null,"Van Dijck Vincent",{"$f":"$J$8/$J$23","v":0.79166666666666663},{"$f":"$K$8","v":3},{"$f":"'Seizoen 2013-2014  '!$E$40","v":1},null,null,null,null,null,null,null,null,"De Decker Koen",0.76530612244897955,3,1]
[null,null,"De Decker Guy",{"$f":"$J$6/$J$23","v":0.64166666666666672},{"$f":"$K$6","v":2},{"$f":"'Seizoen 2013-2014  '!$E$39","v":0},null,null,null,null,null,null,null,null,"Bloemen Bart",0.77419354838709675,1,1]
[null,null,"Vajda Dierckx Davy",{"$f":"($J$10/$J$23)*1.2","v":0.69},{"$f":"$K$10","v":4},{"$f":"'Seizoen 2013-2014  '!$E$42","v":1},null,null,null,null,null,null,null,null,"Van Gils Bart",0.77551020408163263,3,1]
[null,null,"Daemen Geert-Jan",{"$f":"$J$20/($J$23-42)","v":0.70512820512820518},{"$f":"$K$20","v":2},{"$f":"'Seizoen 2013-2014  '!$E$49","v":1},null,null,null,null,null,null,null,null,"De Decker Hans",0.93877551020408168,1,1]
[null,null,"Bloemen Bart",{"$f":"$J$19/($J$23-67)","v":0.45283018867924529},{"$f":"$K$19","v":1},{"$f":"'Seizoen 2013-2014  '!$E$48","v":1},null,null,null,null,null,null,null,null,"Westhof Jan",0.94897959183673475,3,1]
[null,null,"Daemen Jan",{"$f":"$J$17/($J$23-42)","v":0.30769230769230771},{"$f":"$K$17","v":7},{"$f":"'Seizoen 2013-2014  '!$E$44","v":3},null,null,null,null,null,null,null,null,"Daemen Jan",0.35714285714285715,7,3]
[]
[]
[null,null,"Afvallers"]
[null,null,"Speler","% Aanwezig","Afvaller","Seizoen 13-14"]
[null,null,"De Decker Guy",0.66326530612244894,2,0]
[null,null,"Van Dijck Vincent",0.76530612244897955,2,0]
[null,null,"Dom Steven",0.94897959183673475,1,0]
[null,null,"Vajda Dierckx Davy",0.69795918367346932,4,1]
[null,null,"Daemen Geert-Jan",0.7321428571428571,2,1]
[null,null,"De Decker Koen",0.76530612244897955,3,1]
[null,null,"Bloemen Bart",0.77419354838709675,1,1]
[null,null,"Van Gils Bart",0.77551020408163263,3,1]
[null,null,"De Decker Hans",0.93877551020408168,1,1]
[null,null,"Westhof Jan",0.94897959183673475,3,1]
[null,null,"Daemen Jan",0.35714285714285715,7,3]